program: Orca
programVersion: 5.0.2
elementType: N C C C C C C C C C C C C C C C C C C C H H H H H H H H H H H H H H H H H H H H H H H H H H H H H H H
charge: 0
multiplicity: 1
keywords: wb97x-d3
keywords: def2-TZVPP
keywords: def2/J RIJCOSX
keywords: DEFGRID2
keywords: scfconv7
keywords: smallprint printgap noloewdin
keywords: NOSOSCF
formula: C19H31N
InChI: InChI=1/C19H31N/c1-16(15-20-12-6-5-7-13-20)14-17-8-10-18(11-9-17)19(2,3)4/h8-11,16H,5-7,12-15H2,1-4H3
51 atoms
N  1.97349 -1.063549 -0.072341
C  3.196343 -0.297962 -0.180468
C  3.083326 1.16192 0.26313
C  1.947453 -2.221088 -0.944114
C  1.661184 -1.433358 1.29333
C  0.571254 -2.870346 -0.945714
C  0.276682 -2.054888 1.397633
C  0.146394 -3.252518 0.465898
C  2.118816 1.980636 -0.609451
C  4.469942 1.796155 0.223228
C  0.659208 1.658126 -0.448427
C  -3.506157 0.472407 0.083259
C  -2.071995 0.957201 -0.09632
C  -0.08921 1.115708 -1.489997
C  0.002412 1.888198 0.754543
C  -1.418512 0.767471 -1.316526
C  -1.334261 1.545552 0.928196
C  -4.412467 1.079752 -0.992815
C  -4.076299 0.842807 1.451322
C  -3.518739 -1.05685 -0.046674
H  3.506831 -0.300049 -1.230861
H  4.021221 -0.775494 0.378772
H  2.731419 1.203867 1.299582
H  2.703545 -2.973056 -0.650465
H  2.204156 -1.901948 -1.957253
H  1.709702 -0.548324 1.930922
H  2.409947 -2.143837 1.692381
H  -0.153261 -2.168206 -1.370864
H  0.584884 -3.747157 -1.597038
H  0.089486 -2.348117 2.43317
H  -0.474729 -1.302161 1.14017
H  -0.877408 -3.633689 0.47029
H  0.785214 -4.06487 0.828381
H  2.407081 1.861761 -1.658656
H  2.269755 3.038332 -0.370901
H  5.17757 1.251014 0.849953
H  4.443873 2.827958 0.576606
H  4.870018 1.806724 -0.793696
H  0.385538 0.932005 -2.447122
H  0.54233 2.330858 1.584446
H  -1.948033 0.320766 -2.150018
H  -1.788756 1.738891 1.890655
H  -5.437314 0.722367 -0.871002
H  -4.430954 2.169242 -0.926577
H  -4.094247 0.812974 -2.001311
H  -4.100596 1.923262 1.60608
H  -5.101675 0.47806 1.533975
H  -3.508134 0.397804 2.270109
H  -4.531728 -1.445808 0.078989
H  -3.157501 -1.385896 -1.022579
H  -2.887179 -1.521129 0.714124
elementType: N C H
totalener: -797.52658441 hartree
nucrepener: 1692.34738866 hartree
electener: -2489.87397307 hartree
oneelecener: -4440.70042384 hartree
twoeener: 1950.82645076 hartree
cpcmener: -0.01266817 hartree
kineticenergy: 793.51524277 hartree
xcener: -82.791703197958 hartree
chargesum: -0.0000000
charge: -0.154022 -0.180357 0.109553 -0.112832 -0.139237 -0.145876 -0.080197 -0.122098 -0.117555 -0.312646 0.140212 0.366072 -0.107639 -0.296224 -0.278840 -0.199876 -0.156650 -0.329701 -0.359613 -0.353275 0.091190 0.078382 0.041383 0.075200 0.084813 0.096205 0.079852 0.059446 0.079748 0.080030 0.000531 0.075660 0.074508 0.087066 0.102921 0.091196 0.091188 0.087382 0.134859 0.137709 0.141626 0.140917 0.097014 0.100023 0.097293 0.103050 0.100574 0.097659 0.104211 0.099776 0.099389
qa: -0.1540 -0.1804 0.1096 -0.1128 -0.1392 -0.1459 -0.0802 -0.1221 -0.1176 -0.3126 0.1402 0.3661 -0.1076 -0.2962 -0.2788 -0.1999 -0.1566 -0.3297 -0.3596 -0.3533 0.0912 0.0784 0.0414 0.0752 0.0848 0.0962 0.0799 0.0594 0.0797 0.0800 0.0005 0.0757 0.0745 0.0871 0.1029 0.0912 0.0912 0.0874 0.1349 0.1377 0.1416 0.1409 0.0970 0.1000 0.0973 0.1031 0.1006 0.0977 0.1042 0.0998 0.0994
va: 2.8310 3.9632 3.7152 3.9142 3.9228 3.9153 3.9007 3.8492 3.7851 3.9458 3.5012 3.5866 3.6713 4.0232 3.9803 3.9326 3.8212 3.9120 3.9279 3.9314 1.0020 1.0111 1.0261 1.0120 1.0055 1.0004 1.0203 1.0182 1.0168 1.0181 1.0485 1.0128 1.0163 1.0125 1.0007 1.0057 1.0044 1.0010 1.0064 1.0059 1.0028 1.0008 1.0037 1.0035 1.0042 1.0012 1.0068 1.0003 1.0076 1.0016 1.0002
dispcorr: -0.028807629 hartree
energy: -797.555392041397
dipole: -1.36804 1.67420 0.30616 -6.43187 6.09913 -0.33274 2.22889 -2.08206 0.14683
magnitude: 0.47541 au
magnitude: 1.20839 debye
