program: Orca
programVersion: 5.0.2
elementType: N C C C C C C C C C C C C C C C C C C C H H H H H H H H H H H H H H H H H H H H H H H H H H H H H H H
charge: 0
multiplicity: 1
keywords: wb97x-d3
keywords: def2-TZVPP
keywords: def2/J RIJCOSX
keywords: DEFGRID2
keywords: scfconv7
keywords: smallprint printgap noloewdin
keywords: NOSOSCF
formula: C19H31N
InChI: InChI=1/C19H31N/c1-16(15-20-12-6-5-7-13-20)14-17-8-10-18(11-9-17)19(2,3)4/h8-11,16H,5-7,12-15H2,1-4H3
51 atoms
N  3.02649 -1.841387 -0.32955
C  3.201423 -0.427478 -0.041829
C  1.91923 0.344619 0.266635
C  4.264398 -2.396878 -0.855649
C  2.605575 -2.573829 0.85583
C  4.125291 -3.867175 -1.212576
C  2.4088 -4.055199 0.577461
C  3.670437 -4.673734 -0.004868
C  0.935688 0.282619 -0.908408
C  2.275335 1.78277 0.620569
C  -0.421797 0.834193 -0.582031
C  -4.392038 2.33943 0.425984
C  -2.995679 1.844114 0.067206
C  -1.293207 0.12047 0.241722
C  -0.859723 2.059918 -1.065186
C  -2.546748 0.61367 0.558003
C  -2.12181 2.555303 -0.749008
C  -5.430532 1.32201 -0.062399
C  -4.708156 3.690903 -0.211496
C  -4.505381 2.486692 1.947863
H  3.671566 0.035901 -0.915869
H  3.906777 -0.282433 0.796121
H  1.433231 -0.098072 1.14243
H  5.091601 -2.281903 -0.131944
H  4.550141 -1.827111 -1.743163
H  1.667592 -2.156321 1.22533
H  3.342425 -2.454722 1.67142
H  3.403112 -3.97895 -2.026654
H  5.083005 -4.233819 -1.58834
H  2.125018 -4.55339 1.507167
H  1.574802 -4.187846 -0.117936
H  3.502971 -5.718664 -0.274338
H  4.460803 -4.665382 0.753061
H  0.827425 -0.756528 -1.223987
H  1.363207 0.825387 -1.757419
H  1.388596 2.368859 0.864902
H  2.780943 2.2803 -0.210701
H  2.940017 1.824531 1.48518
H  -0.986843 -0.842359 0.636445
H  -0.208596 2.643344 -1.706409
H  -3.189915 0.019812 1.196689
H  -2.411535 3.513043 -1.160255
H  -6.440082 1.662125 0.178293
H  -5.374776 1.187481 -1.144288
H  -5.295805 0.344168 0.402065
H  -4.674285 3.650312 -1.301761
H  -5.714806 4.003779 0.070825
H  -4.02099 4.472427 0.117729
H  -5.50452 2.831323 2.22319
H  -4.331564 1.542469 2.465954
H  -3.786609 3.213941 2.330235
elementType: N C H
totalener: -797.53354984 hartree
nucrepener: 1558.19596492 hartree
electener: -2355.72951476 hartree
oneelecener: -4171.82428841 hartree
twoeener: 1816.09477365 hartree
cpcmener: -0.01291743 hartree
kineticenergy: 793.52048303 hartree
xcener: -82.788883696848 hartree
chargesum: -0.0000000
charge: -0.195630 -0.153577 0.101191 -0.116744 -0.101110 -0.132716 -0.150223 -0.103537 -0.099490 -0.341688 -0.005189 0.338040 -0.116091 -0.242247 -0.200214 -0.196503 -0.156235 -0.329916 -0.358306 -0.330773 0.095085 0.085604 0.051291 0.070776 0.085056 0.087340 0.080141 0.056584 0.073817 0.074235 0.061780 0.072672 0.066261 0.093194 0.091344 0.097758 0.087568 0.097249 0.148266 0.136579 0.141542 0.146456 0.096534 0.101372 0.096857 0.100442 0.099906 0.100428 0.096710 0.096956 0.101154
qa: -0.1956 -0.1536 0.1012 -0.1167 -0.1011 -0.1327 -0.1502 -0.1035 -0.0995 -0.3417 -0.0052 0.3380 -0.1161 -0.2422 -0.2002 -0.1965 -0.1562 -0.3299 -0.3583 -0.3308 0.0951 0.0856 0.0513 0.0708 0.0851 0.0873 0.0801 0.0566 0.0738 0.0742 0.0618 0.0727 0.0663 0.0932 0.0913 0.0978 0.0876 0.0972 0.1483 0.1366 0.1415 0.1465 0.0965 0.1014 0.0969 0.1004 0.0999 0.1004 0.0967 0.0970 0.1012
va: 2.8444 3.9048 3.7107 3.9447 3.8994 3.9136 3.9448 3.8396 3.7200 3.9657 3.5894 3.6235 3.7378 4.0000 3.9731 4.0002 3.8921 3.9162 3.9274 3.9166 1.0006 1.0148 1.0206 1.0075 1.0052 1.0052 1.0140 1.0224 1.0141 1.0145 1.0171 1.0140 1.0160 1.0460 1.0137 0.9990 1.0032 1.0051 0.9997 1.0083 1.0029 0.9971 1.0036 1.0035 1.0042 1.0010 1.0068 1.0009 1.0033 1.0042 1.0036
dispcorr: -0.023233387 hartree
energy: -797.556783227220
dipole: 1.42500 -1.14639 0.27862 -1.52738 1.43119 -0.09619 3.78576 -3.41356 0.37220
magnitude: 0.47478 au
magnitude: 1.20678 debye
