program: Orca
programVersion: 5.0.2
elementType: N C C C C C C C C C C C C C C C C C C C H H H H H H H H H H H H H H H H H H H H H H H H H H H H H H H
charge: 0
multiplicity: 1
keywords: wb97x-d3
keywords: def2-TZVPP
keywords: def2/J RIJCOSX
keywords: DEFGRID2
keywords: scfconv7
keywords: smallprint printgap noloewdin
keywords: NOSOSCF
formula: C19H31N
InChI: InChI=1/C19H31N/c1-16(15-20-12-6-5-7-13-20)14-17-8-10-18(11-9-17)19(2,3)4/h8-11,16H,5-7,12-15H2,1-4H3
51 atoms
N  3.065605 -1.883773 -0.17564
C  3.148275 -0.433614 -0.142993
C  1.841889 0.301082 0.156936
C  4.307896 -2.433187 -0.700842
C  2.787957 -2.422013 1.147619
C  4.274706 -3.951002 -0.784505
C  2.704482 -3.940604 1.145908
C  3.975965 -4.557464 0.57906
C  0.756649 -0.074928 -0.859787
C  2.117282 1.800032 0.168743
C  -0.567886 0.582558 -0.602681
C  -4.424642 2.455245 0.216956
C  -3.06826 1.826893 -0.084039
C  -1.424356 0.100389 0.386776
C  -0.984043 1.696582 -1.320633
C  -2.643486 0.707411 0.63868
C  -2.208698 2.30683 -1.067667
C  -4.705348 3.678565 -0.654788
C  -4.468945 2.891617 1.686306
C  -5.526346 1.41867 -0.03712
H  3.501926 -0.097146 -1.123528
H  3.909981 -0.102687 0.585633
H  1.484938 0.023766 1.154844
H  5.171094 -2.12837 -0.081342
H  4.478886 -2.011921 -1.694509
H  1.842695 -2.01483 1.511014
H  3.562633 -2.104995 1.869818
H  3.511147 -4.261493 -1.503912
H  5.23327 -4.306436 -1.168967
H  2.52663 -4.284992 2.167083
H  1.841687 -4.25838 0.552309
H  3.884498 -5.643799 0.51163
H  4.811845 -4.353076 1.256653
H  0.625362 -1.158485 -0.849745
H  1.110307 0.188171 -1.862129
H  2.441236 2.151382 -0.814272
H  2.904076 2.0479 0.883515
H  1.233352 2.37333 0.449046
H  -1.134922 -0.77076 0.964743
H  -0.345258 2.098124 -2.099306
H  -3.277827 0.291442 1.412884
H  -2.480476 3.169721 -1.660875
H  -3.966817 4.468544 -0.506176
H  -4.724584 3.431716 -1.717788
H  -5.681926 4.093543 -0.400105
H  -3.697735 3.633332 1.902671
H  -5.436805 3.339656 1.921731
H  -4.323824 2.052013 2.367423
H  -6.509074 1.846462 0.172212
H  -5.523689 1.085491 -1.076497
H  -5.411293 0.537147 0.595297
elementType: N C H
totalener: -797.53365402 hartree
nucrepener: 1555.27115411 hartree
electener: -2352.80480813 hartree
oneelecener: -4165.98697874 hartree
twoeener: 1813.18217060 hartree
cpcmener: -0.01303869 hartree
kineticenergy: 793.50485360 hartree
xcener: -82.785890840388 hartree
chargesum: -0.0000000
charge: -0.197832 -0.165249 0.123939 -0.115775 -0.099754 -0.133790 -0.153682 -0.101122 -0.112445 -0.347662 0.000270 0.333173 -0.110852 -0.234334 -0.203827 -0.197432 -0.166573 -0.357558 -0.330086 -0.329220 0.095297 0.086594 0.053200 0.070139 0.085635 0.087628 0.081079 0.056475 0.073995 0.074610 0.062775 0.072476 0.065694 0.092479 0.094459 0.088960 0.098150 0.097635 0.144831 0.138155 0.142579 0.145985 0.101155 0.099478 0.100640 0.101034 0.096814 0.097053 0.096542 0.101486 0.096781
qa: -0.1978 -0.1652 0.1239 -0.1158 -0.0998 -0.1338 -0.1537 -0.1011 -0.1124 -0.3477 0.0003 0.3332 -0.1109 -0.2343 -0.2038 -0.1974 -0.1666 -0.3576 -0.3301 -0.3292 0.0953 0.0866 0.0532 0.0701 0.0856 0.0876 0.0811 0.0565 0.0740 0.0746 0.0628 0.0725 0.0657 0.0925 0.0945 0.0890 0.0981 0.0976 0.1448 0.1382 0.1426 0.1460 0.1012 0.0995 0.1006 0.1010 0.0968 0.0971 0.0965 0.1015 0.0968
va: 2.8394 3.9128 3.6897 3.9450 3.8932 3.9136 3.9487 3.8377 3.7404 3.9680 3.5600 3.6274 3.7327 3.9992 3.9753 3.9966 3.9080 3.9265 3.9161 3.9163 1.0009 1.0146 1.0198 1.0074 1.0047 1.0062 1.0136 1.0224 1.0140 1.0145 1.0164 1.0142 1.0162 1.0398 1.0117 1.0030 1.0060 0.9977 1.0023 1.0075 1.0024 0.9976 1.0008 1.0010 1.0065 1.0037 1.0035 1.0041 1.0038 1.0036 1.0040
dispcorr: -0.023222811 hartree
energy: -797.556876832789
dipole: 1.99380 -1.68181 0.31199 -0.25205 0.26414 0.01209 3.51497 -3.15524 0.35973
magnitude: 0.47633 au
magnitude: 1.21074 debye
