program: Orca
programVersion: 5.0.2
elementType: N C C C C C C C C C C C C C C C C C C C H H H H H H H H H H H H H H H H H H H H H H H H H H H H H H H
charge: 0
multiplicity: 1
keywords: wb97x-d3
keywords: def2-TZVPP
keywords: def2/J RIJCOSX
keywords: DEFGRID2
keywords: scfconv7
keywords: smallprint printgap noloewdin
keywords: NOSOSCF
formula: C19H31N
InChI: InChI=1/C19H31N/c1-16(15-20-12-6-5-7-13-20)14-17-8-10-18(11-9-17)19(2,3)4/h8-11,16H,5-7,12-15H2,1-4H3
51 atoms
N  1.875572 -1.02853 -0.114127
C  3.089406 -0.269168 -0.329978
C  3.100813 1.124212 0.303131
C  1.66335 -2.043161 -1.126736
C  1.799621 -1.590837 1.218967
C  0.298471 -2.696366 -0.973755
C  0.444164 -2.231366 1.476757
C  0.126104 -3.282072 0.421517
C  2.142496 2.105732 -0.38909
C  4.518403 1.684623 0.252149
C  0.684691 1.756596 -0.297004
C  -3.461738 0.434079 0.035144
C  -2.041741 0.977352 -0.095652
C  -0.058587 1.42807 -1.424007
C  0.025883 1.739855 0.929626
C  -1.389765 1.042528 -1.326099
C  -1.301682 1.351971 1.028919
C  -4.262375 0.614255 -1.256191
C  -4.22839 1.131921 1.162345
C  -3.367363 -1.065699 0.350129
H  3.229938 -0.146224 -1.409063
H  3.974715 -0.82663 0.025399
H  2.812073 1.046393 1.356923
H  2.445024 -2.825192 -1.094125
H  1.736797 -1.574408 -2.111288
H  1.972382 -0.802597 1.954822
H  2.593879 -2.344458 1.380237
H  -0.479261 -1.948607 -1.160054
H  0.182405 -3.47113 -1.735096
H  0.438354 -2.672289 2.476133
H  -0.327948 -1.455638 1.468257
H  -0.88784 -3.666436 0.555089
H  0.80418 -4.133496 0.54201
H  2.430079 2.192081 -1.441718
H  2.301594 3.095062 0.051809
H  5.220389 1.044796 0.789149
H  4.56932 2.678579 0.699086
H  4.871945 1.769551 -0.778461
H  0.4152 1.446227 -2.399091
H  0.563058 2.013171 1.831249
H  -1.910245 0.775137 -2.236291
H  -1.755509 1.33316 2.011441
H  -5.285224 0.263527 -1.107602
H  -4.313391 1.662426 -1.557585
H  -3.8506 0.044395 -2.089735
H  -4.278428 2.21126 1.006012
H  -5.252427 0.755964 1.202023
H  -3.78849 0.955092 2.143994
H  -4.363388 -1.502999 0.453354
H  -2.847434 -1.605277 -0.44435
H  -2.828105 -1.244448 1.282636
elementType: N C H
totalener: -797.52657343 hartree
nucrepener: 1695.04637838 hartree
electener: -2492.57295182 hartree
oneelecener: -4446.16945256 hartree
twoeener: 1953.59650074 hartree
cpcmener: -0.01357222 hartree
kineticenergy: 793.51349420 hartree
xcener: -82.791086754900 hartree
chargesum: -0.0000000
charge: -0.162459 -0.183863 0.112109 -0.116249 -0.128170 -0.136117 -0.118815 -0.116017 -0.120294 -0.313284 0.130377 0.346339 -0.007128 -0.252019 -0.278819 -0.237201 -0.238149 -0.337396 -0.335757 -0.385194 0.093233 0.082077 0.039476 0.079977 0.086042 0.096734 0.077152 0.046012 0.079008 0.079231 0.034841 0.076995 0.075091 0.086308 0.101405 0.090731 0.091745 0.088249 0.133326 0.138366 0.143556 0.144220 0.099067 0.108869 0.094873 0.104911 0.098107 0.096905 0.107407 0.101269 0.102923
qa: -0.1625 -0.1839 0.1121 -0.1162 -0.1282 -0.1361 -0.1188 -0.1160 -0.1203 -0.3133 0.1304 0.3463 -0.0071 -0.2520 -0.2788 -0.2372 -0.2381 -0.3374 -0.3358 -0.3852 0.0932 0.0821 0.0395 0.0800 0.0860 0.0967 0.0772 0.0460 0.0790 0.0792 0.0348 0.0770 0.0751 0.0863 0.1014 0.0907 0.0917 0.0882 0.1333 0.1384 0.1436 0.1442 0.0991 0.1089 0.0949 0.1049 0.0981 0.0969 0.1074 0.1013 0.1029
va: 2.8215 3.9533 3.7214 3.9127 3.9150 3.9208 3.9107 3.8329 3.7804 3.9459 3.5204 3.5940 3.6117 3.9838 3.9663 3.9196 3.9165 3.9048 3.9064 3.9529 1.0015 1.0107 1.0286 1.0119 1.0038 0.9999 1.0190 1.0252 1.0183 1.0181 1.0306 1.0118 1.0167 1.0122 1.0022 1.0059 1.0042 1.0007 1.0070 1.0045 1.0014 1.0024 1.0052 1.0023 1.0019 1.0027 1.0042 1.0034 1.0085 0.9986 0.9970
dispcorr: -0.029019549 hartree
energy: -797.555592982558
dipole: -1.28540 1.60398 0.31858 -7.06101 6.67735 -0.38365 1.60397 -1.49049 0.11349
magnitude: 0.51144 au
magnitude: 1.29996 debye
