program: Orca
programVersion: 5.0.2
elementType: N C C C C C C C C C C C C C C C C C C C H H H H H H H H H H H H H H H H H H H H H H H H H H H H H H H
charge: 0
multiplicity: 1
keywords: wb97x-d3
keywords: def2-TZVPP
keywords: def2/J RIJCOSX
keywords: DEFGRID2
keywords: scfconv7
keywords: smallprint printgap noloewdin
keywords: NOSOSCF
formula: C19H31N
InChI: InChI=1/C19H31N/c1-16(15-20-12-6-5-7-13-20)14-17-8-10-18(11-9-17)19(2,3)4/h8-11,16H,5-7,12-15H2,1-4H3
51 atoms
N  1.834057 -1.006688 -0.058997
C  3.042568 -0.255293 -0.331404
C  3.087231 1.151877 0.270512
C  1.618558 -2.065841 -1.025528
C  1.787955 -1.512157 1.298439
C  0.275924 -2.74897 -0.81531
C  0.453076 -2.175039 1.605946
C  0.152233 -3.282254 0.605386
C  2.141344 2.136752 -0.434166
C  4.515287 1.682152 0.197108
C  0.685851 1.779497 -0.350183
C  -3.439918 0.39073 -0.021752
C  -2.005479 0.897918 -0.138079
C  0.014611 1.797453 0.868511
C  -0.034939 1.38665 -1.4715
C  -1.297795 1.361452 0.973255
C  -1.35015 0.95379 -1.368137
C  -4.397819 1.563262 -0.260659
C  -3.708856 -0.200776 1.365212
C  -3.725239 -0.704191 -1.054725
H  3.146278 -0.156418 -1.417237
H  3.936104 -0.812282 0.004704
H  2.804833 1.104209 1.327565
H  2.420184 -2.826989 -0.983216
H  1.656045 -1.633645 -2.02883
H  1.949768 -0.688114 1.996246
H  2.602633 -2.238292 1.482423
H  -0.528454 -2.032811 -1.012063
H  0.166016 -3.555993 -1.543171
H  0.474151 -2.568095 2.624796
H  -0.341273 -1.422289 1.5737
H  -0.843193 -3.69803 0.776532
H  0.864278 -4.102256 0.747295
H  2.438484 2.217874 -1.484447
H  2.297822 3.126626 0.006091
H  5.206066 1.045903 0.752617
H  4.587673 2.688653 0.611953
H  4.867188 1.726868 -0.836581
H  0.533382 2.126381 1.762403
H  0.44847 1.381886 -2.441952
H  -1.762513 1.374215 1.950411
H  -1.856747 0.638968 -2.271447
H  -4.247357 2.354927 0.47586
H  -4.253685 1.997649 -1.251659
H  -5.437405 1.235385 -0.189129
H  -3.660454 0.546226 2.158043
H  -4.710831 -0.63222 1.39692
H  -2.998432 -0.994153 1.607785
H  -3.686547 -0.336814 -2.080459
H  -3.017186 -1.531352 -0.967723
H  -4.727491 -1.107682 -0.900268
elementType: N C H
totalener: -797.52616880 hartree
nucrepener: 1696.00525122 hartree
electener: -2493.53142002 hartree
oneelecener: -4448.10946994 hartree
twoeener: 1954.57804992 hartree
cpcmener: -0.01362578 hartree
kineticenergy: 793.51522922 hartree
xcener: -82.791078600675 hartree
chargesum: 0.0000000
charge: -0.164327 -0.183317 0.109884 -0.123936 -0.129159 -0.120360 -0.121450 -0.103968 -0.125018 -0.314063 0.134753 0.314655 -0.067536 -0.275172 -0.258117 -0.204191 -0.204015 -0.328571 -0.342278 -0.343606 0.093927 0.083390 0.041146 0.080687 0.086480 0.096517 0.077421 0.033972 0.079236 0.079474 0.035297 0.074168 0.069957 0.086612 0.100274 0.090513 0.091751 0.088713 0.138395 0.133848 0.145083 0.145503 0.097385 0.097748 0.097923 0.095617 0.100163 0.105662 0.096515 0.104887 0.101529
qa: -0.1643 -0.1833 0.1099 -0.1239 -0.1292 -0.1204 -0.1214 -0.1040 -0.1250 -0.3141 0.1348 0.3147 -0.0675 -0.2752 -0.2581 -0.2042 -0.2040 -0.3286 -0.3423 -0.3436 0.0939 0.0834 0.0411 0.0807 0.0865 0.0965 0.0774 0.0340 0.0792 0.0795 0.0353 0.0742 0.0700 0.0866 0.1003 0.0905 0.0918 0.0887 0.1384 0.1338 0.1451 0.1455 0.0974 0.0977 0.0979 0.0956 0.1002 0.1057 0.0965 0.1049 0.1015
va: 2.8177 3.9440 3.7230 3.9225 3.9157 3.9260 3.9218 3.8323 3.7926 3.9479 3.5075 3.6079 3.5919 3.9769 3.9900 3.8803 3.9006 3.9135 3.9125 3.9118 1.0013 1.0112 1.0281 1.0115 1.0029 1.0001 1.0187 1.0297 1.0174 1.0174 1.0297 1.0140 1.0156 1.0118 1.0039 1.0058 1.0040 1.0005 1.0040 1.0064 0.9983 0.9983 1.0042 1.0039 1.0030 1.0038 1.0060 1.0003 1.0045 0.9997 1.0057
dispcorr: -0.028870310 hartree
energy: -797.555039107689
dipole: -1.31973 1.61837 0.29864 -6.88844 6.56026 -0.32818 1.73373 -1.62225 0.11148
magnitude: 0.45751 au
magnitude: 1.16290 debye
