program: Gaussian 09
title: 000063373
version: EM64L-G09RevD.01
frameworkgroup: C1[X(C22H24ClN3O)]
method: RPBEPBE
basis: SDD
operation: Freq
keyword: #p
keyword: freq=noraman
keyword: PBEPBE/SDD
title: #p freq=noraman PBEPBE/SDD
converged: YES YES NO NO
title: Mulliken charges:
elementType: Cl O N N N C C C C C C C C C C C C C C C C C C C C C C H H H H H H H H H H H H H H H H H H H H H H H H
charge: -0.058887 -0.234431 -0.065065 -0.369367 -0.015429 -0.345217 -0.365549 -0.398804 -0.389923 -0.398629 -0.362914 -0.503399 0.056272 0.359300 0.112096 0.160002 0.057108 0.416824 -0.354461 -0.325601 -0.356816 -0.284606 -0.805939 -0.233040 -0.246468 -0.206358 -0.254597 0.166413 0.210638 0.215880 0.165717 0.192380 0.206837 0.205585 0.193032 0.215221 0.188205 0.191633 0.244694 0.244855 0.253807 0.255739 0.272717 0.262005 0.244317 0.239093 0.278503 0.239564 0.234435 0.233739 0.258889
chargesum: 0.00000
title: Mulliken charges with hydrogens summed into heavy atoms:
elementType: Cl O N N N C C C C C C C C C C C C C C C C C C C C C C
charge: -0.058887 -0.234431 -0.065065 -0.369367 -0.015429 0.031834 0.016048 0.000413 0.008695 0.004797 0.073413 -0.004736 0.056272 0.359300 0.112096 0.160002 0.057108 0.416824 -0.098722 -0.052884 -0.094811 -0.284606 -0.044026 0.006525 -0.012032 0.027381 0.004291
polarizability: 3.31965901e+02 4.64747660e+01 3.09061503e+02 7.67154452e+00 7.16897553e+00 1.90244939e+02
1716.lowfreq: -16.9864 -5.7954 -0.0016 -0.0011 -0.0004 3.7331 9.3494 15.4837 28.5004
frequency: -13.1493 15.0851 28.4662 30.4800 39.4387 55.6648 73.7501 86.6356 106.0075 112.1130 123.5385 135.2798 171.3146 191.8283 215.5845 220.7880 232.8468 260.2965 266.9237 287.2820 301.2420 317.4321 332.6326 351.9042 371.9862 384.5032 394.9340 425.3527 438.2294 449.4525 484.5824 496.9355 506.7750 523.7115 535.5276 539.3951 550.4415 566.2768 588.8815 627.8925 653.7432 689.2246 698.4676 711.0914 719.4170 767.9733 775.9199 785.0032 785.9556 794.9447 800.9741 804.1654 849.4808 855.7480 860.4024 864.6020 897.5765 901.5375 905.6818 957.4822 968.5960 979.7218 988.9536 994.0906 1002.9065 1009.7730 1018.1413 1027.8364 1030.5767 1042.7401 1049.5740 1061.5613 1068.4228 1087.0775 1102.4643 1106.2132 1120.2830 1146.1307 1150.9900 1156.8322 1163.4015 1172.1338 1187.4718 1216.4631 1217.4976 1229.0127 1239.3175 1253.7137 1260.6226 1266.5547 1280.4548 1286.8699 1294.0992 1301.8486 1321.3808 1330.1608 1340.1768 1341.1336 1350.8460 1363.1292 1366.7443 1386.6986 1391.7181 1401.2427 1428.7527 1447.1774 1451.7063 1453.0468 1456.3659 1458.2677 1460.4551 1463.2009 1466.5187 1471.3129 1473.0459 1475.8996 1482.4058 1547.0629 1562.7536 1573.2870 1606.1664 1611.6385 1621.2165 2813.6548 2824.2467 2852.6619 2966.5213 2986.8262 2986.8888 2990.8827 3026.2273 3032.3244 3035.7563 3038.3007 3040.6369 3046.9177 3055.9243 3072.2059 3104.8220 3114.9952 3135.1741 3145.1371 3149.5776 3161.4307 3164.2725 3173.7688 3178.7492
redmass: 3.1293 5.9868 5.0737 5.2124 4.9128 4.6540 3.7718 1.1151 3.4134 6.3522 4.4174 4.8045 5.3287 2.6274 4.8280 4.3210 1.8393 4.3324 4.3292 4.1149 2.2743 4.0611 4.2886 4.8441 2.6667 2.5991 4.2723 3.7567 3.6728 2.9168 4.7216 4.4038 3.2658 3.9365 5.4438 3.1763 4.9034 3.1625 5.8713 5.2107 5.5806 4.4376 5.0652 2.9848 4.7061 3.2367 1.4423 1.4888 1.7446 3.7436 3.2322 1.5939 2.2459 1.7899 4.2327 3.8037 1.5262 1.4643 2.3605 1.2987 1.3557 1.3739 2.9183 2.6582 1.3313 2.1695 2.4643 2.2542 3.3579 1.5680 2.1582 2.7616 2.0583 1.6819 1.9142 2.2331 2.6468 1.5888 1.2731 2.4401 1.1872 1.3307 1.7380 2.0916 2.2899 2.2288 2.1182 1.7622 1.4100 1.1905 1.7063 1.4086 1.6752 1.4550 2.3017 1.2761 1.4349 1.4168 1.4749 8.1398 1.3697 1.3927 9.7375 1.2321 2.1885 2.2634 1.1011 2.3486 1.7479 1.6821 1.0874 1.1194 1.0894 1.1605 1.0893 1.1300 1.0983 9.0687 6.9869 6.6786 7.5504 9.0772 8.0985 1.0716 1.0703 1.0695 1.0630 1.0624 1.0602 1.0392 1.0880 1.0903 1.0765 1.0889 1.0728 1.1033 1.1036 1.0959 1.1029 1.0984 1.0861 1.0872 1.0900 1.0933 1.0954 1.1000 1.0990
irintensity: 0.1266 0.0748 0.3985 0.0906 0.4612 0.1079 0.2406 1.4061 0.1718 4.5377 0.8164 0.8762 0.4224 2.0496 0.3755 2.1847 0.6186 0.1053 3.8227 1.7658 2.6227 6.5294 0.8321 5.2688 6.6584 5.2638 1.4810 1.1712 1.2298 0.3186 1.4632 0.4213 0.3310 0.5369 1.9282 0.1629 3.8721 1.5112 5.0149 7.0920 11.6514 21.1564 5.9450 25.0586 37.2589 0.4907 29.9010 80.4604 14.5388 8.3308 0.9099 0.3948 4.7794 9.5264 1.9694 7.4465 0.7947 0.8974 2.4076 3.3466 0.1346 2.5278 7.1882 17.0201 0.0028 27.6879 54.0532 30.6191 16.3703 9.2140 12.9269 17.3702 6.1750 5.6219 3.3890 62.5305 2.9388 16.2652 3.4612 44.4371 0.7570 13.5085 15.2659 15.0945 6.0065 50.5335 3.9399 16.8747 0.3538 8.6489 15.8051 8.3762 9.1334 14.1324 70.1308 14.0675 35.3764 3.0030 2.7966 9.7557 13.6746 2.8747 28.5310 20.9542 25.3103 24.1397 10.0567 20.8521 31.3485 30.3761 12.3503 12.5709 8.0521 24.7682 2.3848 33.5517 12.9332 304.6027 1.6029 27.8928 0.9391 280.0074 71.8845 47.4227 95.1041 134.2915 39.5114 27.3771 38.5615 8.9712 43.9182 85.6308 6.5471 11.5726 34.4833 16.3264 89.3417 9.7694 17.9501 8.7283 4.7937 4.2983 7.4195 5.6931 11.2441 26.4053 6.8418
temp: 298.150 k
press: 1.00000 atm
elementType: 17 8 7 7 7 6 6 6 6 6 6 6 6 6 6 6 6 6 6 6 6 6 6 6 6 6 6 1 1 1 1 1 1 1 1 1 1 1 1 1 1 1 1 1 1 1 1 1 1 1 1
symmnumber: 1
zpe: 1086236.5 jmol-1
zpe.correction: 0.413726 hartree
zpe.thermalcorrener: 0.437302 hartree
zpe.thermalcorrenthalpy: 0.438246 hartree
zpe.thermalcorrgfe: 0.358663 hartree
zpe.sumelectzpe: -1550.345713 hartree
zpe.sumelectthermal: -1550.322137 hartree
zpe.sumelectthermalent: -1550.321193 hartree
zpe.sumelectthermalfe: -1550.400776 hartree
dipole: 1.9758 -2.1942 0.9160
dipole: 3.0915
quadrupole: -153.6057 -169.5346 -165.1946
quadrupole: 11.2364 8.8342 -1.0509
quadrupole: 9.1726 -6.7563 -2.4163 11.2364 8.8342 -1.0509
hfenergy: -1550.7594389 hartree
pointgroup: C01 [X(C22H24Cl1N3O1)]
dipole: 0.6701669 -0.8942375 0.4801374 debye
polarizability: 342.813549|43.0699169|297.9529647|1.831067|-8.587775|190.5058298 unknown
charge 0 multiplicity 1
51 atoms
Cl 1.238268 4.99149 -1.818778
O  -2.780217 2.065308 0.67702
N  2.929219 -1.974869 -0.053187
N  -1.080235 0.58494 0.003951
N  -1.525824 -1.709274 -0.58321
C  3.813219 -0.786103 0.060124
C  3.484282 -3.133206 0.69623
C  5.227737 -1.088154 -0.475944
C  4.885159 -3.511682 0.1740
C  5.844313 -2.302154 0.255337
C  1.527977 -1.684963 0.320614
C  0.771639 -0.932389 -0.811057
C  -0.681562 -0.695212 -0.457322
C  -0.115298 1.664431 0.181585
C  -2.45342 0.896854 0.320573
C  -3.374528 -0.244926 0.191933
C  -2.877129 -1.512687 -0.25048
C  0.024627 2.647855 -0.840206
C  0.621803 1.712886 1.382024
C  -4.749929 -0.084494 0.505345
C  -3.778613 -2.607158 -0.368642
C  0.973139 3.666593 -0.582109
C  -0.825218 2.596536 -2.089661
C  1.555824 2.748796 1.590155
C  -5.627278 -1.174256 0.385947
C  -5.136406 -2.437754 -0.052453
C  1.738993 3.735923 0.598519
H  3.888165 -0.450296 1.130188
H  3.369344 0.049846 -0.510108
H  2.791167 -3.986688 0.577033
H  3.553991 -2.908869 1.794704
H  5.865225 -0.191547 -0.352247
H  5.158764 -1.304368 -1.559493
H  4.793766 -3.842122 -0.878665
H  5.277792 -4.363704 0.761768
H  6.829368 -2.55732 -0.178934
H  6.017664 -2.041234 1.320329
H  1.464341 -1.098963 1.273276
H  1.002172 -2.642017 0.490808
H  1.280365 0.015447 -1.050057
H  0.798355 -1.576641 -1.705048
H  0.44427 0.954207 2.150285
H  -5.093779 0.900195 0.838396
H  -3.380371 -3.567187 -0.710408
H  -0.391581 3.203101 -2.899199
H  -0.949168 1.560644 -2.449441
H  -1.834904 2.991445 -1.869289
H  2.131414 2.796917 2.519565
H  -6.688428 -1.055355 0.628606
H  -5.825599 -3.284446 -0.14489
H  2.454323 4.550925 0.739908
