program: Orca
programVersion: 5.0.2
elementType: N C C C C C C C C C C C C C C C C C C C H H H H H H H H H H H H H H H H H H H H H H H H H H H H H H H
charge: 0
multiplicity: 1
keywords: wb97x-d3
keywords: def2-TZVPP
keywords: def2/J RIJCOSX
keywords: DEFGRID2
keywords: scfconv7
keywords: smallprint printgap noloewdin
keywords: NOSOSCF
formula: C19H31N
InChI: InChI=1/C19H31N/c1-16(15-20-12-6-5-7-13-20)14-17-8-10-18(11-9-17)19(2,3)4/h8-11,16H,5-7,12-15H2,1-4H3
51 atoms
N  1.951066 -1.059805 -0.279177
C  3.157451 -0.259059 -0.306556
C  3.069615 1.085558 0.417748
C  1.928482 -2.048983 -1.339544
C  1.724231 -1.674174 1.014398
C  0.594682 -2.77737 -1.389377
C  0.388526 -2.400501 1.067209
C  0.283537 -3.42969 -0.049549
C  2.098894 2.069788 -0.253113
C  4.462048 1.706275 0.471597
C  0.642143 1.712671 -0.163441
C  -3.546318 0.533459 0.182567
C  -2.09296 0.968186 0.030899
C  0.003124 1.620993 1.072758
C  -0.123911 1.470408 -1.295528
C  -1.328668 1.253892 1.16658
C  -1.46147 1.099821 -1.202204
C  -3.60484 -0.7474 1.02216
C  -4.210875 0.251395 -1.162598
C  -4.335321 1.641313 0.888997
H  3.404734 -0.054394 -1.353629
H  4.01648 -0.822663 0.100763
H  2.740635 0.925179 1.449882
H  2.741422 -2.790651 -1.227159
H  2.104477 -1.541606 -2.291401
H  1.746659 -0.9056 1.789623
H  2.532528 -2.387706 1.262363
H  -0.195305 -2.064611 -1.646723
H  0.621864 -3.522751 -2.187357
H  0.278978 -2.876226 2.044312
H  -0.424382 -1.672253 0.979102
H  -0.707989 -3.887291 -0.062328
H  1.000455 -4.2371 0.13321
H  2.383089 2.186433 -1.303658
H  2.246827 3.050652 0.210543
H  5.171662 1.052454 0.981098
H  4.451451 2.659058 1.002838
H  4.849759 1.894415 -0.532685
H  0.55847 1.827705 1.980895
H  0.334961 1.544784 -2.274943
H  -1.776242 1.183145 2.151024
H  -2.001634 0.905042 -2.119072
H  -3.177538 -0.607324 2.015666
H  -4.640306 -1.06953 1.154242
H  -3.063628 -1.562347 0.537404
H  -5.245401 -0.057489 -1.003127
H  -4.23118 1.13186 -1.806885
H  -3.712129 -0.552606 -1.706551
H  -4.3104 2.569743 0.316171
H  -5.381652 1.350804 1.006236
H  -3.942043 1.852725 1.883783
elementType: N C H
totalener: -797.52805555 hartree
nucrepener: 1681.87097671 hartree
electener: -2479.39903226 hartree
oneelecener: -4419.82672243 hartree
twoeener: 1940.42769016 hartree
cpcmener: -0.01379375 hartree
kineticenergy: 793.52042134 hartree
xcener: -82.791645336266 hartree
chargesum: 0.0000000
charge: -0.160254 -0.183590 0.112886 -0.115591 -0.139934 -0.147006 -0.087221 -0.106955 -0.114728 -0.312702 0.128006 0.385600 -0.113509 -0.305127 -0.264299 -0.196482 -0.167400 -0.355934 -0.362858 -0.328821 0.092047 0.081086 0.041389 0.076701 0.085408 0.096022 0.081496 0.057868 0.077805 0.079463 0.008115 0.073404 0.071407 0.086265 0.102796 0.090932 0.091566 0.088371 0.140543 0.133121 0.137436 0.143014 0.103030 0.104745 0.095858 0.100646 0.100271 0.100215 0.101003 0.097146 0.096754
qa: -0.1603 -0.1836 0.1129 -0.1156 -0.1399 -0.1470 -0.0872 -0.1070 -0.1147 -0.3127 0.1280 0.3856 -0.1135 -0.3051 -0.2643 -0.1965 -0.1674 -0.3559 -0.3629 -0.3288 0.0920 0.0811 0.0414 0.0767 0.0854 0.0960 0.0815 0.0579 0.0778 0.0795 0.0081 0.0734 0.0714 0.0863 0.1028 0.0909 0.0916 0.0884 0.1405 0.1331 0.1374 0.1430 0.1030 0.1047 0.0959 0.1006 0.1003 0.1002 0.1010 0.0971 0.0968
va: 2.8382 3.9621 3.7138 3.9144 3.9224 3.9293 3.9181 3.8370 3.7796 3.9443 3.5180 3.5631 3.6751 3.9777 4.0129 3.9270 3.8490 3.9231 3.9285 3.9144 1.0019 1.0116 1.0268 1.0111 1.0052 0.9996 1.0188 1.0186 1.0165 1.0169 1.0404 1.0141 1.0150 1.0127 1.0006 1.0060 1.0043 1.0008 1.0037 1.0081 1.0060 0.9994 1.0016 1.0071 1.0026 1.0067 1.0011 1.0007 1.0037 1.0036 1.0038
dispcorr: -0.027832258 hartree
energy: -797.555887810495
dipole: -1.24235 1.55469 0.31235 -6.46293 6.15174 -0.31119 1.42622 -1.26965 0.15658
magnitude: 0.46789 au
magnitude: 1.18927 debye
