program: Orca
programVersion: 5.0.2
elementType: N C C C C C C C C C C C C C C C C C C C H H H H H H H H H H H H H H H H H H H H H H H H H H H H H H H
charge: 0
multiplicity: 1
keywords: wb97x-d3
keywords: def2-TZVPP
keywords: def2/J RIJCOSX
keywords: DEFGRID2
keywords: scfconv7
keywords: smallprint printgap noloewdin
keywords: NOSOSCF
formula: C19H31N
InChI: InChI=1/C19H31N/c1-16(15-20-12-6-5-7-13-20)14-17-8-10-18(11-9-17)19(2,3)4/h8-11,16H,5-7,12-15H2,1-4H3
51 atoms
N  2.52739 -1.562771 0.220065
C  2.386596 -0.33185 -0.540929
C  2.521927 0.932551 0.31322
C  1.302737 -1.865015 0.945006
C  2.898236 -2.671852 -0.644528
C  1.437201 -3.11818 1.795434
C  3.098953 -3.958361 0.141407
C  1.850191 -4.307956 0.939963
C  1.795252 2.117736 -0.340103
C  3.9861 1.265681 0.567989
C  0.303783 1.930683 -0.376095
C  -3.988214 1.127254 -0.353854
C  -2.493591 1.428695 -0.392347
C  -0.437422 1.916234 0.806265
C  -0.384951 1.710138 -1.561206
C  -1.799336 1.669431 0.797443
C  -1.755192 1.465612 -1.570709
C  -4.731788 2.295109 0.304675
C  -4.221673 -0.148414 0.46529
C  -4.570691 0.913229 -1.749971
H  1.429901 -0.326704 -1.089938
H  3.168666 -0.307372 -1.307294
H  2.047401 0.757367 1.284205
H  0.453699 -1.992563 0.247295
H  1.042923 -1.019341 1.585597
H  3.823912 -2.411518 -1.165415
H  2.136263 -2.844115 -1.427993
H  2.180846 -2.947861 2.57992
H  0.485845 -3.31037 2.297608
H  3.357294 -4.764277 -0.550485
H  3.950346 -3.83879 0.819489
H  2.018271 -5.193246 1.557921
H  1.036254 -4.55745 0.250006
H  2.177883 2.268389 -1.354784
H  2.038084 3.027354 0.217993
H  4.090889 2.102377 1.261461
H  4.49702 1.538944 -0.358913
H  4.516239 0.414612 0.998334
H  0.059464 2.094845 1.753844
H  0.154634 1.7190 -2.501742
H  -2.327776 1.660566 1.743621
H  -2.233805 1.293235 -2.52573
H  -4.402356 2.467277 1.330497
H  -4.584881 3.223393 -0.251336
H  -5.805378 2.094566 0.337694
H  -3.874726 -0.044887 1.494686
H  -5.286354 -0.390561 0.503071
H  -3.703127 -1.003285 0.026106
H  -5.63898 0.701118 -1.67548
H  -4.459056 1.794943 -2.384139
H  -4.109506 0.067942 -2.264964
elementType: N C H
totalener: -797.54648672 hartree
nucrepener: 1603.65578899 hartree
electener: -2401.20227571 hartree
oneelecener: -4262.73913286 hartree
twoeener: 1861.53685715 hartree
cpcmener: -0.01179162 hartree
kineticenergy: 793.48502136 hartree
xcener: -82.780983381764 hartree
chargesum: 0.0000000
charge: -0.196714 -0.152578 0.069117 -0.099142 -0.104799 -0.147457 -0.134084 -0.105169 -0.125568 -0.304784 0.077658 0.333624 -0.112709 -0.298702 -0.222006 -0.162947 -0.146324 -0.326166 -0.328039 -0.357936 0.098758 0.094418 0.044098 0.071923 0.086672 0.081953 0.071952 0.059846 0.073662 0.073763 0.057759 0.072371 0.066625 0.091101 0.099452 0.091656 0.081680 0.083061 0.139442 0.136649 0.138918 0.143693 0.095633 0.101109 0.095817 0.096100 0.095890 0.101149 0.099357 0.100807 0.099411
qa: -0.1967 -0.1526 0.0691 -0.0991 -0.1048 -0.1475 -0.1341 -0.1052 -0.1256 -0.3048 0.0777 0.3336 -0.1127 -0.2987 -0.2220 -0.1629 -0.1463 -0.3262 -0.3280 -0.3579 0.0988 0.0944 0.0441 0.0719 0.0867 0.0820 0.0720 0.0598 0.0737 0.0738 0.0578 0.0724 0.0666 0.0911 0.0995 0.0917 0.0817 0.0831 0.1394 0.1366 0.1389 0.1437 0.0956 0.1011 0.0958 0.0961 0.0959 0.1011 0.0994 0.1008 0.0994
va: 2.8761 3.9138 3.7278 3.9268 3.9331 3.9343 3.9125 3.8439 3.8424 3.9191 3.5415 3.6308 3.7449 4.0044 3.9760 3.9618 3.8906 3.9160 3.9178 3.9274 1.0082 1.0040 1.0311 1.0131 1.0034 1.0060 1.0065 1.0204 1.0145 1.0142 1.0223 1.0142 1.0161 1.0092 1.0040 1.0044 1.0034 1.0249 1.0047 1.0070 1.0027 0.9980 1.0048 1.0038 1.0036 1.0043 1.0038 1.0047 1.0072 1.0011 1.0010
dispcorr: -0.024085690 hartree
energy: -797.570572407389
dipole: -1.63457 1.30147 -0.33309 -7.12936 6.96099 -0.16837 1.44136 -1.58687 -0.14551
magnitude: 0.40059 au
magnitude: 1.01821 debye
