program: Orca
programVersion: 5.0.2
elementType: N C C C C C C C C C C C C C C C C C C C H H H H H H H H H H H H H H H H H H H H H H H H H H H H H H H
charge: 0
multiplicity: 1
keywords: wb97x-d3
keywords: def2-TZVPP
keywords: def2/J RIJCOSX
keywords: DEFGRID2
keywords: scfconv7
keywords: smallprint printgap noloewdin
keywords: NOSOSCF
formula: C19H31N
InChI: InChI=1/C19H31N/c1-16(15-20-12-6-5-7-13-20)14-17-8-10-18(11-9-17)19(2,3)4/h8-11,16H,5-7,12-15H2,1-4H3
51 atoms
N  2.531374 -1.594858 -0.153433
C  2.360486 -0.2215 -0.595738
C  2.462944 0.791536 0.547366
C  1.305153 -2.111127 0.433432
C  2.986477 -2.459448 -1.229212
C  1.499565 -3.505877 1.005993
C  3.25238 -3.872797 -0.731806
C  2.014735 -4.459287 -0.063705
C  1.767093 2.111648 0.181704
C  3.916623 1.027267 0.935295
C  0.274161 1.964742 0.083219
C  -4.027169 1.244955 -0.111201
C  -2.527632 1.521168 -0.071952
C  -0.39286 1.974953 -1.134503
C  -0.490363 1.749151 1.230523
C  -1.765908 1.759148 -1.211376
C  -1.85494 1.531741 1.15404
C  -4.298348 -0.142619 0.484636
C  -4.585707 1.270499 -1.533005
C  -4.763283 2.305775 0.716073
H  1.405333 -0.103674 -1.133545
H  3.143166 0.01101 -1.325647
H  1.945479 0.387297 1.423967
H  0.491161 -2.136244 -0.315326
H  0.969094 -1.436756 1.224098
H  3.904102 -2.039456 -1.650089
H  2.252438 -2.500017 -2.055639
H  2.210377 -3.459131 1.836723
H  0.55171 -3.859782 1.419239
H  3.572795 -4.495212 -1.570878
H  4.081842 -3.851014 -0.017843
H  2.232626 -5.441543 0.3636
H  1.233802 -4.612383 -0.817367
H  2.170893 2.4918 -0.761826
H  2.011204 2.857377 0.944073
H  4.422535 0.085714 1.153376
H  3.997086 1.656752 1.823621
H  4.467615 1.520104 0.130204
H  0.165251 2.146099 -2.04835
H  -0.00867 1.745317 2.202468
H  -2.228727 1.770782 -2.189288
H  -2.402222 1.362008 2.07389
H  -5.367406 -0.367255 0.463029
H  -3.784564 -0.923799 -0.079812
H  -3.971767 -0.216135 1.523257
H  -4.126274 0.512624 -2.170627
H  -5.657818 1.066633 -1.511123
H  -4.451276 2.241437 -2.014068
H  -5.840269 2.122746 0.702776
H  -4.447034 2.305357 1.760557
H  -4.592423 3.308386 0.318447
elementType: N C H
totalener: -797.54663423 hartree
nucrepener: 1599.21361766 hartree
electener: -2396.76025188 hartree
oneelecener: -4253.85841451 hartree
twoeener: 1857.09816263 hartree
cpcmener: -0.01159366 hartree
kineticenergy: 793.48706113 hartree
xcener: -82.781322427281 hartree
chargesum: 0.0000000
charge: -0.197369 -0.153069 0.067082 -0.097706 -0.101866 -0.144499 -0.135018 -0.105032 -0.120543 -0.304968 0.074109 0.333187 -0.115988 -0.223636 -0.291635 -0.145606 -0.162335 -0.328873 -0.357783 -0.326759 0.098730 0.094066 0.044660 0.071947 0.086036 0.080234 0.071621 0.059088 0.073100 0.073631 0.058021 0.072448 0.066210 0.090133 0.098374 0.082087 0.091899 0.080918 0.138247 0.138291 0.142637 0.139559 0.095710 0.101749 0.096210 0.100677 0.099449 0.099926 0.095592 0.095551 0.101506
qa: -0.1974 -0.1531 0.0671 -0.0977 -0.1019 -0.1445 -0.1350 -0.1050 -0.1205 -0.3050 0.0741 0.3332 -0.1160 -0.2236 -0.2916 -0.1456 -0.1623 -0.3289 -0.3578 -0.3268 0.0987 0.0941 0.0447 0.0719 0.0860 0.0802 0.0716 0.0591 0.0731 0.0736 0.0580 0.0724 0.0662 0.0901 0.0984 0.0821 0.0919 0.0809 0.1382 0.1383 0.1426 0.1396 0.0957 0.1017 0.0962 0.1007 0.0994 0.0999 0.0956 0.0956 0.1015
va: 2.8701 3.9106 3.7335 3.9248 3.9338 3.9321 3.9157 3.8433 3.8395 3.9162 3.5404 3.6283 3.7468 3.9727 4.0092 3.8905 3.9655 3.9178 3.9277 3.9165 1.0078 1.0040 1.0305 1.0139 1.0033 1.0062 1.0068 1.0209 1.0145 1.0143 1.0220 1.0140 1.0157 1.0098 1.0046 1.0281 1.0044 1.0036 1.0063 1.0051 0.9984 1.0023 1.0037 1.0042 1.0044 1.0011 1.0070 1.0010 1.0037 1.0046 1.0038
dispcorr: -0.023947323 hartree
energy: -797.570581548984
dipole: -1.46625 1.15284 -0.31341 -7.32474 7.18809 -0.13665 -0.13465 -0.05144 -0.18609
magnitude: 0.38927 au
magnitude: 0.98945 debye
