program: Orca
programVersion: 5.0.2
elementType: N C C C C C C C C C C C C C C C C C C C H H H H H H H H H H H H H H H H H H H H H H H H H H H H H H H
charge: 0
multiplicity: 1
keywords: wb97x-d3
keywords: def2-TZVPP
keywords: def2/J RIJCOSX
keywords: DEFGRID2
keywords: scfconv7
keywords: smallprint printgap noloewdin
keywords: NOSOSCF
formula: C19H31N
InChI: InChI=1/C19H31N/c1-16(15-20-12-6-5-7-13-20)14-17-8-10-18(11-9-17)19(2,3)4/h8-11,16H,5-7,12-15H2,1-4H3
51 atoms
N  3.256871 -1.962773 0.121022
C  2.887695 -0.591056 -0.172888
C  1.395303 -0.304123 0.005349
C  2.908718 -2.867402 -0.960487
C  4.660749 -2.097208 0.467141
C  3.148693 -4.317542 -0.570802
C  4.97916 -3.511016 0.928855
C  4.591495 -4.533529 -0.131562
C  1.098426 1.125772 -0.472375
C  0.967032 -0.523806 1.449773
C  -0.355548 1.489981 -0.370599
C  -4.611735 2.351939 0.080603
C  -3.128771 2.052535 -0.113227
C  -1.28302 0.990409 -1.278085
C  -0.838047 2.293437 0.659794
C  -2.639641 1.264674 -1.152903
C  -2.191016 2.566934 0.784816
C  -5.056068 1.815539 1.447342
C  -5.480617 1.700256 -0.994023
C  -4.842379 3.867241 0.031854
H  3.200223 -0.299954 -1.191409
H  3.438157 0.063662 0.510953
H  0.82072 -0.985525 -0.632489
H  3.489533 -2.633664 -1.872398
H  1.85765 -2.732406 -1.223162
H  4.893375 -1.389233 1.26628
H  5.316277 -1.837555 -0.384294
H  2.467282 -4.587908 0.241522
H  2.903043 -4.962433 -1.417924
H  6.043506 -3.583123 1.16397
H  4.434917 -3.714571 1.855967
H  4.730772 -5.549687 0.245578
H  5.253951 -4.42746 -0.997369
H  1.429362 1.225851 -1.510572
H  1.696336 1.830846 0.113797
H  1.22143 -1.5295 1.783519
H  -0.10811 -0.397389 1.580998
H  1.4668 0.182372 2.119129
H  -0.945428 0.36913 -2.100683
H  -0.14527 2.708336 1.383456
H  -3.314022 0.844914 -1.887515
H  -2.516132 3.192112 1.608264
H  -4.507102 2.279094 2.268514
H  -6.117584 2.014635 1.61113
H  -4.906366 0.736151 1.517538
H  -5.389478 0.612217 -0.994789
H  -6.530799 1.93571 -0.811608
H  -5.238644 2.059613 -1.996221
H  -5.899688 4.098374 0.180651
H  -4.282953 4.394366 0.806281
H  -4.545452 4.283369 -0.932999
elementType: N C H
totalener: -797.54696716 hartree
nucrepener: 1542.24067798 hartree
electener: -2339.78764514 hartree
oneelecener: -4139.87053117 hartree
twoeener: 1800.08288603 hartree
cpcmener: -0.01129679 hartree
kineticenergy: 793.49604120 hartree
xcener: -82.783718118416 hartree
chargesum: -0.0000000
charge: -0.193215 -0.169472 0.129633 -0.101936 -0.099203 -0.143246 -0.138276 -0.103648 -0.112945 -0.337876 0.000550 0.326632 -0.105809 -0.197371 -0.231669 -0.175913 -0.174495 -0.326918 -0.357515 -0.325332 0.083461 0.093801 0.048768 0.072113 0.090810 0.080256 0.069739 0.060769 0.072303 0.072663 0.058320 0.071772 0.066702 0.096602 0.091829 0.087408 0.098063 0.083669 0.137884 0.134427 0.143850 0.138043 0.095710 0.095459 0.101614 0.100323 0.098901 0.100670 0.095661 0.095364 0.101068
qa: -0.1932 -0.1695 0.1296 -0.1019 -0.0992 -0.1432 -0.1383 -0.1036 -0.1129 -0.3379 0.0006 0.3266 -0.1058 -0.1974 -0.2317 -0.1759 -0.1745 -0.3269 -0.3575 -0.3253 0.0835 0.0938 0.0488 0.0721 0.0908 0.0803 0.0697 0.0608 0.0723 0.0727 0.0583 0.0718 0.0667 0.0966 0.0918 0.0874 0.0981 0.0837 0.1379 0.1344 0.1438 0.1380 0.0957 0.0955 0.1016 0.1003 0.0989 0.1007 0.0957 0.0954 0.1011
va: 2.8635 3.9464 3.6755 3.9134 3.9325 3.9351 3.9221 3.8420 3.8247 3.9276 3.6010 3.6410 3.7350 3.9922 3.9854 3.9172 3.9908 3.9175 3.9275 3.9167 1.0130 1.0005 1.0271 1.0149 1.0045 1.0062 1.0076 1.0181 1.0148 1.0146 1.0214 1.0143 1.0148 1.0104 1.0098 1.0387 1.0002 1.0035 1.0053 1.0081 0.9987 1.0027 1.0044 1.0039 1.0039 1.0008 1.0071 1.0008 1.0038 1.0048 1.0037
dispcorr: -0.023062104 hartree
energy: -797.570029265695
dipole: 0.18678 -0.01163 0.17515 -5.44854 5.41847 -0.03006 2.19673 -2.44018 -0.24346
magnitude: 0.30142 au
magnitude: 0.76614 debye
