program: Orca
programVersion: 5.0.2
elementType: N C C C C C C C C C C C C C C C C C C C H H H H H H H H H H H H H H H H H H H H H H H H H H H H H H H
charge: 0
multiplicity: 1
keywords: wb97x-d3
keywords: def2-TZVPP
keywords: def2/J RIJCOSX
keywords: DEFGRID2
keywords: scfconv7
keywords: smallprint printgap noloewdin
keywords: NOSOSCF
formula: C19H31N
InChI: InChI=1/C19H31N/c1-16(15-20-12-6-5-7-13-20)14-17-8-10-18(11-9-17)19(2,3)4/h8-11,16H,5-7,12-15H2,1-4H3
51 atoms
N  2.661139 -1.675629 -0.206578
C  2.17949 -0.359536 -0.588376
C  2.338646 0.688379 0.513686
C  1.70118 -2.378747 0.627294
C  3.0237 -2.479637 -1.361032
C  2.263002 -3.697393 1.134412
C  3.644727 -3.803435 -0.941751
C  2.708759 -4.579149 -0.024485
C  1.617176 1.990707 0.136713
C  3.809269 0.964207 0.798129
C  0.11923 1.86917 0.086491
C  -4.22575 1.457102 -0.058349
C  -2.709542 1.604945 0.01987
C  -0.580611 1.881815 -1.117667
C  -0.622802 1.724876 1.253918
C  -1.960757 1.754129 -1.149236
C  -2.005657 1.593882 1.222316
C  -4.566788 0.197723 -0.864592
C  -4.827053 2.683098 -0.755821
C  -4.866948 1.332007 1.323187
H  1.128974 -0.406172 -0.9210
H  2.75526 -0.020547 -1.45629
H  1.878502 0.313484 1.434883
H  0.76446 -2.572919 0.071994
H  1.428808 -1.748803 1.476619
H  3.737086 -1.916517 -1.968149
H  2.149317 -2.678851 -2.00789
H  3.110972 -3.496277 1.796162
H  1.503655 -4.203207 1.735869
H  3.885365 -4.387022 -1.833813
H  4.589611 -3.607583 -0.425453
H  3.193461 -5.486578 0.343396
H  1.829934 -4.902571 -0.592887
H  1.992734 2.345217 -0.828536
H  1.888697 2.756787 0.869178
H  3.930109 1.6588 1.631686
H  4.30276 1.405674 -0.072053
H  4.343568 0.048445 1.050933
H  -0.03779 1.995489 -2.049395
H  -0.116652 1.718308 2.213301
H  -2.457123 1.770303 -2.112509
H  -2.528539 1.485537 2.163232
H  -5.649164 0.063574 -0.928047
H  -4.184526 0.248777 -1.885295
H  -4.1486 -0.696909 -0.398705
H  -4.44713 2.809484 -1.770869
H  -5.913201 2.588174 -0.825288
H  -4.610238 3.600472 -0.204611
H  -5.948822 1.229966 1.21984
H  -4.510579 0.45465 1.866512
H  -4.683006 2.210707 1.94456
elementType: N C H
totalener: -797.54720035 hartree
nucrepener: 1579.73535479 hartree
electener: -2377.28255514 hartree
oneelecener: -4214.88352207 hartree
twoeener: 1837.60096692 hartree
cpcmener: -0.01132673 hartree
kineticenergy: 793.49281263 hartree
xcener: -82.782784383601 hartree
chargesum: -0.0000000
charge: -0.195737 -0.164442 0.093612 -0.102143 -0.100162 -0.142257 -0.137151 -0.104716 -0.122264 -0.308396 0.037368 0.329835 -0.112056 -0.244468 -0.224776 -0.163489 -0.160657 -0.328065 -0.326507 -0.357885 0.096654 0.094029 0.042705 0.072129 0.089654 0.080150 0.071090 0.059226 0.073003 0.072682 0.058269 0.071680 0.067052 0.091223 0.098955 0.092700 0.081546 0.080173 0.135991 0.137739 0.138339 0.143036 0.095524 0.095986 0.101713 0.095736 0.095892 0.101090 0.099331 0.100154 0.100902
qa: -0.1957 -0.1644 0.0936 -0.1021 -0.1002 -0.1423 -0.1372 -0.1047 -0.1223 -0.3084 0.0374 0.3298 -0.1121 -0.2445 -0.2248 -0.1635 -0.1607 -0.3281 -0.3265 -0.3579 0.0967 0.0940 0.0427 0.0721 0.0897 0.0802 0.0711 0.0592 0.0730 0.0727 0.0583 0.0717 0.0671 0.0912 0.0990 0.0927 0.0815 0.0802 0.1360 0.1377 0.1383 0.1430 0.0955 0.0960 0.1017 0.0957 0.0959 0.1011 0.0993 0.1002 0.1009
va: 2.8685 3.9333 3.7225 3.9205 3.9300 3.9294 3.9203 3.8426 3.8239 3.9142 3.5753 3.6354 3.7474 3.9774 4.0007 3.9745 3.9017 3.9180 3.9171 3.9271 1.0083 1.0035 1.0295 1.0146 1.0037 1.0059 1.0072 1.0196 1.0144 1.0146 1.0214 1.0145 1.0152 1.0109 1.0048 1.0049 1.0028 1.0351 1.0071 1.0055 1.0023 0.9990 1.0039 1.0044 1.0038 1.0048 1.0036 1.0037 1.0072 1.0007 1.0010
dispcorr: -0.023409597 hartree
energy: -797.570609943956
dipole: -0.85072 0.51171 -0.33900 -6.80110 6.65494 -0.14616 -0.40318 0.22915 -0.17403
magnitude: 0.40813 au
magnitude: 1.03739 debye
