program: Orca
programVersion: 5.0.2
elementType: N C C C C C C C C C C C C C C C C C C C H H H H H H H H H H H H H H H H H H H H H H H H H H H H H H H
charge: 0
multiplicity: 1
keywords: wb97x-d3
keywords: def2-TZVPP
keywords: def2/J RIJCOSX
keywords: DEFGRID2
keywords: scfconv7
keywords: smallprint printgap noloewdin
keywords: NOSOSCF
formula: C19H31N
InChI: InChI=1/C19H31N/c1-16(15-20-12-6-5-7-13-20)14-17-8-10-18(11-9-17)19(2,3)4/h8-11,16H,5-7,12-15H2,1-4H3
51 atoms
N  1.896242 -1.036609 -0.086359
C  3.089215 -0.261337 -0.354607
C  3.104008 1.136352 0.269749
C  1.668768 -2.072321 -1.074509
C  1.865967 -1.570008 1.26024
C  0.324017 -2.750767 -0.862981
C  0.530582 -2.23092 1.567724
C  0.21397 -3.315206 0.546902
C  2.11689 2.103748 -0.401046
C  4.514746 1.71005 0.183536
C  0.666527 1.723825 -0.29913
C  -3.496075 0.440683 -0.008366
C  -2.047617 0.912557 -0.084669
C  0.013154 1.703539 0.927264
C  -0.074853 1.374882 -1.424325
C  -1.311838 1.299281 1.034191
C  -1.398005 0.975993 -1.319278
C  -4.382814 1.386632 -0.826694
C  -4.019584 0.411887 1.426398
C  -3.603612 -0.976749 -0.585266
H  3.184081 -0.142696 -1.43941
H  3.996353 -0.804663 -0.032491
H  2.842925 1.062473 1.330986
H  2.467597 -2.837877 -1.057921
H  1.696315 -1.617675 -2.068349
H  2.039123 -0.761363 1.973413
H  2.680189 -2.30299 1.419191
H  -0.473704 -2.020501 -1.032053
H  0.195853 -3.539741 -1.608122
H  0.556369 -2.643975 2.578928
H  -0.256183 -1.470184 1.555101
H  -0.781483 -3.731143 0.720293
H  0.922722 -4.142587 0.663412
H  2.391866 2.20938 -1.455521
H  2.258183 3.092347 0.048147
H  5.233818 1.083263 0.714149
H  4.566881 2.709271 0.619446
H  4.84987 1.787752 -0.85415
H  0.548161 1.990111 1.826378
H  0.396481 1.393596 -2.400857
H  -1.763302 1.287861 2.017447
H  -1.927343 0.701982 -2.224592
H  -5.42657 1.066353 -0.786165
H  -4.334449 2.407829 -0.443111
H  -4.091575 1.414067 -1.878035
H  -4.00776 1.399536 1.891631
H  -5.054203 0.064085 1.434783
H  -3.444732 -0.266187 2.060631
H  -4.636543 -1.329837 -0.540316
H  -3.291217 -1.021713 -1.629603
H  -2.98933 -1.683207 -0.022766
elementType: N C H
totalener: -797.54294635 hartree
nucrepener: 1690.67314876 hartree
electener: -2488.21609511 hartree
oneelecener: -4437.33100425 hartree
twoeener: 1949.11490914 hartree
cpcmener: -0.01166932 hartree
kineticenergy: 793.49770880 hartree
xcener: -82.787288748830 hartree
chargesum: 0.0000000
charge: -0.161216 -0.180076 0.107886 -0.117438 -0.123305 -0.125344 -0.134086 -0.112415 -0.127686 -0.310926 0.144667 0.377241 -0.078846 -0.258946 -0.272162 -0.197950 -0.214782 -0.327580 -0.358326 -0.350295 0.091935 0.081555 0.038939 0.079292 0.084473 0.095475 0.076573 0.039653 0.077583 0.077991 0.049834 0.075375 0.072218 0.085973 0.100750 0.090091 0.090987 0.088063 0.134040 0.129584 0.138269 0.134157 0.096207 0.100861 0.095661 0.098943 0.098998 0.100339 0.103517 0.100388 0.093861
qa: -0.1612 -0.1801 0.1079 -0.1174 -0.1233 -0.1253 -0.1341 -0.1124 -0.1277 -0.3109 0.1447 0.3772 -0.0788 -0.2589 -0.2722 -0.1980 -0.2148 -0.3276 -0.3583 -0.3503 0.0919 0.0816 0.0389 0.0793 0.0845 0.0955 0.0766 0.0397 0.0776 0.0780 0.0498 0.0754 0.0722 0.0860 0.1007 0.0901 0.0910 0.0881 0.1340 0.1296 0.1383 0.1342 0.0962 0.1009 0.0957 0.0989 0.0990 0.1003 0.1035 0.1004 0.0939
va: 2.8228 3.9477 3.7280 3.9174 3.9067 3.9316 3.9230 3.8349 3.7847 3.9473 3.5155 3.5632 3.6370 3.9765 4.0016 3.8537 3.9578 3.9167 3.9309 3.9285 1.0015 1.0110 1.0276 1.0116 1.0037 1.0010 1.0188 1.0263 1.0174 1.0168 1.0253 1.0125 1.0158 1.0117 1.0032 1.0061 1.0044 1.0008 1.0058 1.0078 1.0026 1.0067 1.0038 1.0040 1.0041 1.0017 1.0073 0.9998 1.0078 1.0015 1.0030
dispcorr: -0.028545140 hartree
energy: -797.571491491883
dipole: -1.34255 1.62260 0.28004 -6.54206 6.25140 -0.29066 1.30708 -1.24500 0.06208
magnitude: 0.40837 au
magnitude: 1.03798 debye
