program: Orca
programVersion: 5.0.2
elementType: N C C C C C C C C C C C C C C C C C C C H H H H H H H H H H H H H H H H H H H H H H H H H H H H H H H
charge: 0
multiplicity: 1
keywords: wb97x-d3
keywords: def2-TZVPP
keywords: def2/J RIJCOSX
keywords: DEFGRID2
keywords: scfconv7
keywords: smallprint printgap noloewdin
keywords: NOSOSCF
formula: C19H31N
InChI: InChI=1/C19H31N/c1-16(15-20-12-6-5-7-13-20)14-17-8-10-18(11-9-17)19(2,3)4/h8-11,16H,5-7,12-15H2,1-4H3
51 atoms
N  2.998306 -1.781897 -0.061006
C  3.295912 -0.363482 -0.113528
C  2.066303 0.528579 0.067098
C  4.032794 -2.587239 -0.686034
C  2.72988 -2.242571 1.290256
C  3.619806 -4.049863 -0.763414
C  2.259474 -3.688882 1.299134
C  3.277153 -4.593555 0.617539
C  1.052857 0.290529 -1.061421
C  2.487817 1.989428 0.144183
C  -0.325403 0.79056 -0.738857
C  -4.331355 2.215175 0.251687
C  -2.932467 1.701551 -0.071927
C  -1.149095 0.068208 0.118472
C  -0.828593 1.981957 -1.255506
C  -2.423094 0.512383 0.44554
C  -2.101864 2.425458 -0.929573
C  -4.22807 3.590764 0.922004
C  -5.086495 1.279924 1.195035
C  -5.13882 2.341494 -1.046133
H  3.734425 -0.14407 -1.093024
H  4.060097 -0.081695 0.632061
H  1.582406 0.274633 1.016319
H  4.993153 -2.509992 -0.144018
H  4.212659 -2.202762 -1.693052
H  1.961684 -1.613093 1.742372
H  3.627486 -2.144796 1.928824
H  2.750476 -4.141169 -1.422186
H  4.42562 -4.629979 -1.219379
H  2.086697 -4.005746 2.330297
H  1.297372 -3.754711 0.781271
H  2.9003 -5.616864 0.547443
H  4.186934 -4.637425 1.226527
H  1.00459 -0.782613 -1.26014
H  1.419288 0.764064 -1.977925
H  3.163638 2.164908 0.983411
H  1.629015 2.649407 0.277485
H  3.003751 2.301767 -0.767646
H  -0.794471 -0.867846 0.537017
H  -0.218622 2.571936 -1.930537
H  -3.018676 -0.09632 1.112714
H  -2.449472 3.356437 -1.362162
H  -5.222209 3.974381 1.163135
H  -3.659358 3.536894 1.852653
H  -3.742607 4.327338 0.27977
H  -4.582234 1.167104 2.156882
H  -6.080163 1.684047 1.397223
H  -5.223733 0.284309 0.768451
H  -6.146704 2.706895 -0.836164
H  -4.680302 3.038303 -1.749531
H  -5.234802 1.377277 -1.54943
elementType: N C H
totalener: -797.54703883 hartree
nucrepener: 1565.17387458 hartree
electener: -2362.72091341 hartree
oneelecener: -4185.79466491 hartree
twoeener: 1823.07375150 hartree
cpcmener: -0.01076820 hartree
kineticenergy: 793.49993679 hartree
xcener: -82.784472084799 hartree
chargesum: -0.0000000
charge: -0.192810 -0.142267 0.093157 -0.104434 -0.110344 -0.139555 -0.148261 -0.099747 -0.108037 -0.332460 0.036700 0.327825 -0.119879 -0.230590 -0.253791 -0.161411 -0.158474 -0.326675 -0.360038 -0.326034 0.093167 0.082039 0.046768 0.071245 0.081274 0.093809 0.077951 0.059017 0.073392 0.073225 0.061715 0.071690 0.066121 0.094004 0.089083 0.094331 0.096370 0.085405 0.143104 0.136978 0.142379 0.137787 0.095850 0.101069 0.095853 0.100627 0.099097 0.101061 0.095252 0.095857 0.101603
qa: -0.1928 -0.1423 0.0932 -0.1044 -0.1103 -0.1396 -0.1483 -0.0997 -0.1080 -0.3325 0.0367 0.3278 -0.1199 -0.2306 -0.2538 -0.1614 -0.1585 -0.3267 -0.3600 -0.3260 0.0932 0.0820 0.0468 0.0712 0.0813 0.0938 0.0780 0.0590 0.0734 0.0732 0.0617 0.0717 0.0661 0.0940 0.0891 0.0943 0.0964 0.0854 0.1431 0.1370 0.1424 0.1378 0.0958 0.1011 0.0959 0.1006 0.0991 0.1011 0.0953 0.0959 0.1016
va: 2.8465 3.9103 3.7243 3.9325 3.9047 3.9229 3.9404 3.8381 3.7276 3.9669 3.5690 3.6367 3.7555 4.0083 3.9963 3.9024 3.9707 3.9167 3.9280 3.9165 0.9999 1.0128 1.0258 1.0076 1.0064 1.0008 1.0159 1.0207 1.0143 1.0150 1.0172 1.0149 1.0149 1.0522 1.0130 1.0052 1.0015 1.0030 1.0030 1.0065 0.9992 1.0022 1.0036 1.0038 1.0047 1.0007 1.0073 1.0009 1.0041 1.0046 1.0036
dispcorr: -0.023464488 hartree
energy: -797.570503318253
dipole: 1.12566 -0.81234 0.31332 -1.02541 0.99114 -0.03427 3.59193 -3.34985 0.24208
magnitude: 0.39742 au
magnitude: 1.01017 debye
