program: Gaussian 09
title: 000063368
version: EM64L-G09RevD.01
frameworkgroup: C1[X(C16H13FN2O)]
method: RPBEPBE
basis: SDD
operation: Freq
keyword: #p
keyword: freq=noraman
keyword: PBEPBE/SDD
title: #p freq=noraman PBEPBE/SDD
converged: YES YES NO NO
title: Mulliken charges:
elementType: F O N N C C C C C C C C C C C C C C C C H H H H H H H H H H H H H
charge: -0.202457 -0.236449 -0.356102 -0.037934 0.410606 0.093118 0.172708 0.120419 0.176191 0.040099 -0.377939 -0.323708 0.195632 -0.766466 -0.347868 -0.808189 -0.197939 -0.391562 -0.244282 -0.205596 0.259328 0.272179 0.246327 0.252254 0.268436 0.261261 0.253898 0.278512 0.229940 0.238453 0.258394 0.234483 0.234254
chargesum: 0.00000
title: Mulliken charges with hydrogens summed into heavy atoms:
elementType: F O N N C C C C C C C C C C C C C C C C
charge: -0.202457 -0.236449 -0.356102 -0.037934 0.410606 0.093118 0.172708 0.120419 0.176191 0.040099 -0.118612 -0.051529 0.195632 0.000550 -0.086607 -0.045839 0.040514 -0.133168 -0.009799 0.028658
polarizability: 2.84508791e+02 7.66899031e+00 1.62994567e+02 1.25787420e+01 -1.25837349e+00 1.28730643e+02
1716.lowfreq: -0.0007 -0.0004 0.0002 4.2443 6.4514 8.4570 35.1348 38.7581 63.1842
frequency: 35.1057 38.6765 63.1829 102.0841 119.7597 126.4555 149.1939 154.5034 174.3953 217.4210 245.8148 268.6577 296.5133 298.2696 311.2620 341.9388 358.0369 433.7428 444.5465 476.0870 504.6288 508.6277 525.2682 539.7163 550.2753 562.1703 615.9950 627.8093 634.9976 654.6278 693.3140 710.3274 760.9236 784.1512 791.7672 798.2401 816.2431 848.2307 881.1241 897.8795 900.3794 968.6432 979.9026 988.8953 1003.3309 1005.7202 1023.3178 1044.1339 1046.5910 1060.5466 1069.3384 1096.5317 1110.6555 1164.2490 1169.1389 1198.2106 1218.6431 1228.0354 1236.8957 1257.2798 1292.7223 1310.5757 1377.1347 1391.4655 1397.0711 1401.6586 1442.1544 1446.7267 1455.5319 1457.5077 1463.4245 1465.1443 1475.0723 1479.7145 1561.1646 1563.6767 1589.0958 1612.3741 1620.9786 1623.5993 2990.6012 2996.5972 3069.1007 3075.3329 3116.1058 3134.2232 3135.4583 3146.5165 3149.8793 3163.8062 3164.8107 3174.4321 3182.5367
redmass: 6.2614 5.3440 5.4188 3.5398 1.0354 5.9580 3.9596 1.9128 1.6105 5.4496 4.3726 4.5254 3.9134 4.3641 3.9348 5.5240 5.8359 3.6352 6.0473 5.3720 4.7306 3.7715 4.4649 7.5433 4.7731 6.4820 5.6716 4.8563 4.8900 6.0082 4.4610 2.5840 4.3412 1.5055 1.7279 3.4756 5.3166 4.9597 2.8971 1.5154 1.5740 1.3402 1.3745 3.0397 1.3318 2.1245 2.0199 1.5070 1.5452 2.1191 2.1561 2.6141 2.1646 1.1348 1.3343 2.8607 2.2910 2.0683 3.1121 3.1913 2.0927 4.3350 8.2379 9.5839 1.2423 1.2361 1.9847 1.4266 1.9676 2.6224 1.1105 1.4977 1.7209 1.1713 6.7239 7.1037 6.8707 8.5111 8.1034 8.0958 1.0384 1.0383 1.0970 1.0969 1.0983 1.0989 1.0862 1.0878 1.0901 1.0932 1.0956 1.0998 1.0989
irintensity: 0.4430 0.4648 0.0889 3.9839 0.7670 2.1439 3.1899 0.8006 0.1164 0.6006 0.1666 3.7475 2.5538 2.0287 5.9322 3.2531 0.6571 0.1762 0.1318 9.5620 0.5588 1.0286 0.1850 0.7636 0.2554 5.9716 1.7874 6.8191 4.3566 11.4169 14.2028 19.3818 18.0048 78.5667 45.1295 1.6405 21.0674 4.4500 8.1398 0.8490 3.7475 0.2244 2.8645 4.2731 0.0077 7.1945 14.1874 7.7777 2.2161 22.3780 25.8417 19.6227 41.4924 0.1963 13.4561 11.4742 11.9012 14.7810 15.4006 55.7661 2.1092 133.2341 5.7868 27.6062 32.3871 14.6583 18.6774 31.9822 32.6690 41.2021 27.3250 22.6559 27.9246 39.0866 226.1664 14.4481 25.0640 270.4451 24.9835 76.2336 10.1074 13.9978 9.7007 8.4599 9.6972 9.2020 4.5235 4.6082 7.0780 6.4898 11.4904 23.8287 5.8962
temp: 298.150 k
press: 1.00000 atm
elementType: 9 8 7 7 6 6 6 6 6 6 6 6 6 6 6 6 6 6 6 6 1 1 1 1 1 1 1 1 1 1 1 1 1
symmnumber: 1
zpe: 658296.6 jmol-1
zpe.correction: 0.250732 hartree
zpe.thermalcorrener: 0.267618 hartree
zpe.thermalcorrenthalpy: 0.268562 hartree
zpe.thermalcorrgfe: 0.205888 hartree
zpe.sumelectzpe: -900.715104 hartree
zpe.sumelectthermal: -900.698218 hartree
zpe.sumelectthermalent: -900.697274 hartree
zpe.sumelectthermalfe: -900.759948 hartree
dipole: -0.4742 2.3464 0.4412
dipole: 2.4342
quadrupole: -102.1376 -118.0935 -113.2108
quadrupole: 10.1808 5.9699 3.6718
quadrupole: 9.0097 -6.9462 -2.0635 10.1808 5.9699 3.6718
hfenergy: -900.9658358 hartree
pointgroup: C01 [X(C16H13F1N2O1)]
dipole: -0.1760738 0.8270694 0.4495376 debye
polarizability: 284.8147092|2.606405|160.4728824|12.9199422|8.8300551|130.9464093 unknown
InChI: InChI=1S/C16H13FN2O/c1-10-13(17)7-5-9-15(10)19-11(2)18-14-8-4-3-6-12(14)16(19)20/h3-9H,1-2H3
charge 0 multiplicity 1
33 atoms
F  4.519275 -0.705608 -1.652368
O  -0.193425 -2.015045 0.122915
N  0.10361 0.316489 0.212903
N  -1.737863 1.864338 0.055938
C  1.53886 0.110538 0.362012
C  -0.439536 1.6247 0.15965
C  -2.16125 -0.584565 0.020148
C  -0.718095 -0.864507 0.117021
C  2.315356 -0.208872 -0.784428
C  -2.62219 0.770494 -0.003317
C  2.109681 0.22016 1.648256
C  -3.088641 -1.657072 -0.051654
C  3.695396 -0.389636 -0.548553
C  0.517472 2.791369 0.211399
C  -4.018238 1.02703 -0.096949
C  1.710793 -0.383233 -2.158986
C  3.496901 0.026897 1.822579
C  4.309371 -0.279534 0.709253
C  -4.4642 -1.388959 -0.142032
C  -4.926743 -0.042017 -0.164378
H  1.462978 0.437638 2.504127
H  -2.699719 -2.680398 -0.032772
H  1.301339 2.711706 -0.562981
H  1.03396 2.855006 1.185695
H  -0.063927 3.710804 0.054136
H  -4.349681 2.069527 -0.114532
H  2.488207 -0.38514 -2.938054
H  1.169654 -1.346422 -2.20902
H  0.981974 0.41506 -2.385918
H  3.942784 0.106203 2.818555
H  5.387126 -0.439309 0.804008
H  -5.182688 -2.213564 -0.19566
H  -6.000942 0.161323 -0.235794
