program: Orca
programVersion: 5.0.2
elementType: N C C C C C C C C C C C C C C C C C C C H H H H H H H H H H H H H H H H H H H H H H H H H H H H H H H
charge: 0
multiplicity: 1
keywords: wb97x-d3
keywords: def2-TZVPP
keywords: def2/J RIJCOSX
keywords: DEFGRID2
keywords: scfconv7
keywords: smallprint printgap noloewdin
keywords: NOSOSCF
formula: C19H31N
InChI: InChI=1/C19H31N/c1-16(15-20-12-6-5-7-13-20)14-17-8-10-18(11-9-17)19(2,3)4/h8-11,16H,5-7,12-15H2,1-4H3
51 atoms
N  1.886583 -1.021228 -0.177888
C  3.091025 -0.24506 -0.381674
C  3.113034 1.100014 0.349589
C  1.604977 -1.937968 -1.262959
C  1.85505 -1.692522 1.104812
C  0.228181 -2.565786 -1.103967
C  0.491669 -2.313893 1.369413
C  0.095772 -3.261187 0.244461
C  2.140615 2.12736 -0.252606
C  4.528198 1.668068 0.319489
C  0.686102 1.756939 -0.191498
C  -3.452581 0.397787 0.065951
C  -2.025145 0.921097 -0.055464
C  0.019199 1.662529 1.029314
C  -0.044969 1.485938 -1.339324
C  -1.300463 1.249842 1.095044
C  -1.371585 1.073309 -1.274244
C  -4.062817 0.058707 -1.293247
C  -4.334845 1.453291 0.742946
C  -3.444141 -0.879188 0.916321
H  3.194696 -0.045019 -1.453532
H  3.990583 -0.820459 -0.097414
H  2.841355 0.943827 1.399501
H  2.363353 -2.741136 -1.33244
H  1.649316 -1.387616 -2.206338
H  2.084138 -0.974944 1.895698
H  2.632249 -2.478699 1.163715
H  -0.530108 -1.781181 -1.189983
H  0.053356 -3.269453 -1.921537
H  0.512569 -2.838852 2.327566
H  -0.250362 -1.514875 1.460255
H  -0.923903 -3.626521 0.389934
H  0.747579 -4.141505 0.264987
H  2.425519 2.309582 -1.293912
H  2.289227 3.076493 0.272722
H  4.870951 1.827339 -0.706312
H  5.239537 0.995291 0.801969
H  4.583907 2.628421 0.835002
H  0.546408 1.892323 1.949072
H  0.433359 1.56933 -2.309014
H  -1.7688 1.172553 2.069518
H  -1.883281 0.85599 -2.202513
H  -4.127987 0.93051 -1.947246
H  -3.49699 -0.714324 -1.817407
H  -5.077886 -0.319778 -1.158407
H  -4.36982 2.375365 0.159117
H  -5.359372 1.087964 0.846571
H  -3.97762 1.706498 1.742376
H  -4.454579 -1.28455 1.009994
H  -2.818015 -1.652441 0.464862
H  -3.072712 -0.697835 1.92599
elementType: N C H
totalener: -797.54218721 hartree
nucrepener: 1697.51347838 hartree
electener: -2495.05566559 hartree
oneelecener: -4450.98195497 hartree
twoeener: 1955.92628938 hartree
cpcmener: -0.01139371 hartree
kineticenergy: 793.49800499 hartree
xcener: -82.787893844702 hartree
chargesum: 0.0000000
charge: -0.159499 -0.180892 0.109235 -0.114903 -0.120749 -0.119864 -0.125186 -0.129081 -0.128083 -0.310602 0.135720 0.376470 -0.086457 -0.292377 -0.232756 -0.211496 -0.189963 -0.360302 -0.326667 -0.349288 0.091699 0.081137 0.037592 0.079205 0.083906 0.095401 0.074770 0.038308 0.078550 0.077651 0.042637 0.077892 0.076648 0.086148 0.101376 0.087768 0.089949 0.091003 0.134002 0.128911 0.134938 0.138201 0.100097 0.100079 0.099956 0.100573 0.096323 0.095713 0.104167 0.091410 0.100734
qa: -0.1595 -0.1809 0.1092 -0.1149 -0.1207 -0.1199 -0.1252 -0.1291 -0.1281 -0.3106 0.1357 0.3765 -0.0865 -0.2924 -0.2328 -0.2115 -0.1900 -0.3603 -0.3267 -0.3493 0.0917 0.0811 0.0376 0.0792 0.0839 0.0954 0.0748 0.0383 0.0785 0.0777 0.0426 0.0779 0.0766 0.0861 0.1014 0.0878 0.0899 0.0910 0.1340 0.1289 0.1349 0.1382 0.1001 0.1001 0.1000 0.1006 0.0963 0.0957 0.1042 0.0914 0.1007
va: 2.8194 3.9518 3.7271 3.9136 3.9101 3.9162 3.9164 3.8449 3.7840 3.9465 3.5185 3.5646 3.6309 3.9927 3.9861 3.9388 3.8632 3.9315 3.9157 3.9309 1.0014 1.0100 1.0283 1.0121 1.0037 1.0006 1.0190 1.0303 1.0175 1.0183 1.0271 1.0104 1.0162 1.0120 1.0025 1.0009 1.0062 1.0044 1.0051 1.0083 1.0065 1.0019 1.0011 0.9986 1.0075 1.0041 1.0036 1.0039 1.0085 1.0027 1.0011
dispcorr: -0.029127753 hartree
energy: -797.571314967070
dipole: -1.38565 1.66406 0.27841 -6.86333 6.55033 -0.31300 1.27464 -1.18556 0.08909
magnitude: 0.42827 au
magnitude: 1.08858 debye
