program: Orca
programVersion: 5.0.2
elementType: N C C C C C C C C C C C C C C C C C C C H H H H H H H H H H H H H H H H H H H H H H H H H H H H H H H
charge: 0
multiplicity: 1
keywords: wb97x-d3
keywords: def2-TZVPP
keywords: def2/J RIJCOSX
keywords: DEFGRID2
keywords: scfconv7
keywords: smallprint printgap noloewdin
keywords: NOSOSCF
formula: C19H31N
InChI: InChI=1/C19H31N/c1-16(15-20-12-6-5-7-13-20)14-17-8-10-18(11-9-17)19(2,3)4/h8-11,16H,5-7,12-15H2,1-4H3
51 atoms
N  2.500154 -1.926201 -0.093952
C  1.786877 -0.774118 0.416576
C  2.226153 0.544209 -0.221922
C  3.840248 -2.040693 0.445936
C  1.759216 -3.159527 0.07809
C  4.62025 -3.153103 -0.238847
C  2.45087 -4.316894 -0.626268
C  3.880076 -4.478861 -0.125611
C  1.552787 1.743498 0.470359
C  1.993969 0.524163 -1.726709
C  0.051841 1.770249 0.383373
C  -4.300046 1.797089 0.060686
C  -2.781994 1.777114 0.200165
C  -0.603036 2.364843 -0.692569
C  -0.739783 1.193782 1.367765
C  -1.983648 2.365871 -0.781284
C  -2.12546 1.194129 1.278206
C  -4.699273 1.069063 -1.229598
C  -4.788258 3.250501 0.002024
C  -4.998084 1.106654 1.232239
H  1.871154 -0.700512 1.517064
H  0.723046 -0.914166 0.204682
H  3.300176 0.677262 -0.050384
H  3.815769 -2.230511 1.536437
H  4.366273 -1.093904 0.3103
H  0.757491 -3.022905 -0.335892
H  1.626705 -3.411964 1.147369
H  4.755744 -2.89355 -1.292603
H  5.61634 -3.225384 0.203849
H  1.878497 -5.234204 -0.470431
H  2.456774 -4.120706 -1.702153
H  4.399774 -5.262671 -0.680981
H  3.864068 -4.797369 0.922463
H  1.957745 2.661545 0.035673
H  1.852156 1.750722 1.52259
H  2.339626 1.446838 -2.196902
H  0.935375 0.404916 -1.964842
H  2.527687 -0.308811 -2.181068
H  -0.021706 2.839438 -1.474407
H  -0.268579 0.735546 2.229975
H  -2.443952 2.841808 -1.638913
H  -2.688651 0.729848 2.076065
H  -5.784434 1.071628 -1.352622
H  -4.268739 1.537665 -2.115058
H  -4.365826 0.030511 -1.212606
H  -5.875388 3.287127 -0.094331
H  -4.5132 3.793823 0.907063
H  -4.366734 3.790746 -0.846246
H  -4.716605 0.055491 1.315516
H  -4.779632 1.593181 2.184349
H  -6.079453 1.141714 1.09182
totalener: -797.52877124 hartree
nucrepener: 1577.05159057 hartree
electener: -2374.58036180 hartree
oneelecener: -4209.03773258 hartree
twoeener: 1834.45737077 hartree
kineticenergy: 793.52890575 hartree
xcener: -82.790318729552 hartree
chargesum: -0.0000000
charge: -0.163552 -0.191947 0.158249 -0.098308 -0.098876 -0.140152 -0.131119 -0.107806 -0.179656 -0.319160 0.104597 0.258798 -0.080195 -0.256745 -0.197961 -0.126571 -0.119662 -0.290631 -0.289913 -0.336444 0.073591 0.095773 0.037542 0.067592 0.081897 0.071069 0.066800 0.063919 0.067759 0.068029 0.062176 0.069521 0.062893 0.094922 0.093782 0.085984 0.083878 0.095710 0.117412 0.107871 0.104440 0.115724 0.085766 0.086427 0.097723 0.085778 0.098509 0.086482 0.093885 0.094435 0.089760
qa: -0.1636 -0.1919 0.1582 -0.0983 -0.0989 -0.1402 -0.1311 -0.1078 -0.1797 -0.3192 0.1046 0.2588 -0.0802 -0.2567 -0.1980 -0.1266 -0.1197 -0.2906 -0.2899 -0.3364 0.0736 0.0958 0.0375 0.0676 0.0819 0.0711 0.0668 0.0639 0.0678 0.0680 0.0622 0.0695 0.0629 0.0949 0.0938 0.0860 0.0839 0.0957 0.1174 0.1079 0.1044 0.1157 0.0858 0.0864 0.0977 0.0858 0.0985 0.0865 0.0939 0.0944 0.0898
va: 2.8963 4.0150 3.6844 3.9154 3.9462 3.9452 3.9271 3.8587 3.8828 3.9364 3.5444 3.7553 3.7750 4.0780 4.0442 4.0424 3.9622 3.9231 3.9224 3.9320 1.0134 0.9915 1.0246 1.0167 1.0067 1.0091 1.0087 1.0179 1.0148 1.0144 1.0212 1.0154 1.0171 1.0075 1.0091 1.0045 1.0011 1.0367 1.0063 1.0129 1.0108 1.0053 1.0066 1.0080 1.0068 1.0064 1.0067 1.0081 1.0031 1.0029 1.0119
dispcorr: -0.023874113 hartree
energy: -797.552645350312
dipole: -0.99849 0.98556 -0.01293 -6.36268 6.24536 -0.11732 -2.23218 2.35796 0.12579
magnitude: 0.17249 au
magnitude: 0.43844 debye
