program: Orca
programVersion: 5.0.2
elementType: N C C C C C C C C C C C C C C C C C C C H H H H H H H H H H H H H H H H H H H H H H H H H H H H H H H
charge: 0
multiplicity: 1
keywords: wb97x-d3
keywords: def2-TZVPP
keywords: def2/J RIJCOSX
keywords: DEFGRID2
keywords: scfconv7
keywords: smallprint printgap noloewdin
keywords: NOSOSCF
formula: C19H31N
InChI: InChI=1/C19H31N/c1-16(15-20-12-6-5-7-13-20)14-17-8-10-18(11-9-17)19(2,3)4/h8-11,16H,5-7,12-15H2,1-4H3
51 atoms
N  2.608471 -1.679926 -0.278561
C  2.095796 -0.355807 -0.570322
C  2.306099 0.63124 0.578277
C  1.713483 -2.441997 0.569986
C  2.959037 -2.422481 -1.47225
C  2.351132 -3.751421 1.008854
C  3.650883 -3.730973 -1.119417
C  2.77764 -4.574193 -0.199802
C  1.6170 1.969945 0.280305
C  3.789483 0.835707 0.854586
C  0.119902 1.876893 0.180286
C  -4.21986 1.494144 -0.042448
C  -2.703545 1.644716 0.009477
C  -0.550469 2.077978 -1.016501
C  -0.649806 1.564657 1.299304
C  -1.933206 1.9666 -1.101071
C  -2.024403 1.449245 1.213974
C  -4.598426 0.061428 0.354502
C  -4.782511 1.766089 -1.43758
C  -4.867065 2.483196 0.935634
H  1.03051 -0.388196 -0.852083
H  2.630125 0.032452 -1.44449
H  1.845538 0.221213 1.484284
H  0.758742 -2.655832 0.053328
H  1.458386 -1.848473 1.449863
H  3.627198 -1.807516 -2.080098
H  2.072332 -2.637472 -2.098096
H  3.221849 -3.530858 1.632415
H  1.645738 -4.310024 1.628267
H  3.889172 -4.276409 -2.035461
H  4.598746 -3.505284 -0.623162
H  3.303422 -5.479165 0.112047
H  1.887218 -4.902551 -0.746654
H  2.024476 2.386624 -0.646647
H  1.883345 2.679279 1.069972
H  4.281977 -0.117451 1.039634
H  3.948271 1.478054 1.722178
H  4.284777 1.306795 0.001695
H  0.014199 2.325785 -1.908002
H  -0.165209 1.410145 2.256959
H  -2.400538 2.136142 -2.061296
H  -2.57766 1.202188 2.112166
H  -5.681676 -0.072719 0.320868
H  -4.148346 -0.665313 -0.323086
H  -4.26953 -0.182858 1.364953
H  -5.86695 1.646381 -1.428769
H  -4.570451 2.78256 -1.773251
H  -4.387528 1.072822 -2.181934
H  -5.954877 2.390482 0.910189
H  -4.549753 2.310231 1.964268
H  -4.611507 3.512462 0.680674
totalener: -797.53001314 hartree
nucrepener: 1581.43940214 hartree
electener: -2378.96941528 hartree
oneelecener: -4217.79836594 hartree
twoeener: 1838.82895066 hartree
kineticenergy: 793.53259606 hartree
xcener: -82.789352870650 hartree
chargesum: -0.0000000
charge: -0.163958 -0.157364 0.090079 -0.097435 -0.093083 -0.136303 -0.132984 -0.109450 -0.159247 -0.277734 0.052651 0.256223 -0.059187 -0.150982 -0.218277 -0.127325 -0.150172 -0.289783 -0.336291 -0.290359 0.099386 0.075795 0.025799 0.071069 0.079825 0.067545 0.068044 0.061963 0.067593 0.067688 0.061857 0.069543 0.063819 0.078842 0.097509 0.091642 0.082431 0.070253 0.102410 0.109556 0.115387 0.104133 0.085504 0.098210 0.086076 0.089577 0.095660 0.093464 0.085646 0.085917 0.098839
qa: -0.1640 -0.1574 0.0901 -0.0974 -0.0931 -0.1363 -0.1330 -0.1095 -0.1592 -0.2777 0.0527 0.2562 -0.0592 -0.1510 -0.2183 -0.1273 -0.1502 -0.2898 -0.3363 -0.2904 0.0994 0.0758 0.0258 0.0711 0.0798 0.0675 0.0680 0.0620 0.0676 0.0677 0.0619 0.0695 0.0638 0.0788 0.0975 0.0916 0.0824 0.0703 0.1024 0.1096 0.1154 0.1041 0.0855 0.0982 0.0861 0.0896 0.0957 0.0935 0.0856 0.0859 0.0988
va: 2.8833 3.9440 3.7531 3.9274 3.9389 3.9337 3.9281 3.8609 3.8516 3.9180 3.6339 3.7599 3.7546 4.0220 4.0697 3.9594 4.0569 3.9222 3.9310 3.9220 1.0103 1.0063 1.0300 1.0164 1.0060 1.0075 1.0084 1.0188 1.0148 1.0147 1.0208 1.0153 1.0169 1.0147 1.0058 1.0337 1.0071 1.0065 1.0154 1.0098 1.0058 1.0117 1.0067 1.0070 1.0079 1.0119 1.0026 1.0031 1.0064 1.0082 1.0066
dispcorr: -0.023539600 hartree
energy: -797.553552739748
dipole: -0.75109 0.54204 -0.20905 -6.97871 6.84184 -0.13687 -0.33451 0.26518 -0.06934
magnitude: 0.25931 au
magnitude: 0.65911 debye
