program: Orca
programVersion: 5.0.2
elementType: N C C C C C C C C C C C C C C C C C C C H H H H H H H H H H H H H H H H H H H H H H H H H H H H H H H
charge: 0
multiplicity: 1
keywords: wb97x-d3
keywords: def2-TZVPP
keywords: def2/J RIJCOSX
keywords: DEFGRID2
keywords: scfconv7
keywords: smallprint printgap noloewdin
keywords: NOSOSCF
formula: C19H31N
InChI: InChI=1/C19H31N/c1-16(15-20-12-6-5-7-13-20)14-17-8-10-18(11-9-17)19(2,3)4/h8-11,16H,5-7,12-15H2,1-4H3
51 atoms
N  2.61595 -1.708442 -0.101442
C  2.080178 -0.450965 -0.584525
C  2.303437 0.708578 0.386908
C  1.741125 -2.343005 0.864693
C  2.968209 -2.618658 -1.171786
C  2.401069 -3.562168 1.49001
C  3.682804 -3.84801 -0.630967
C  2.830996 -4.552899 0.416424
C  1.604782 1.981575 -0.113878
C  3.790593 0.957995 0.598389
C  0.105334 1.88309 -0.139536
C  -4.238763 1.479297 -0.111416
C  -2.721479 1.626702 -0.149774
C  -0.627672 1.903695 1.045244
C  -0.603081 1.741313 -1.323137
C  -2.004477 1.778984 1.038871
C  -1.986833 1.614152 -1.32939
C  -4.841868 1.344243 -1.509774
C  -4.859217 2.711564 0.558999
C  -4.602729 0.223506 0.691357
H  1.009551 -0.536959 -0.832028
H  2.589786 -0.200116 -1.521597
H  1.858249 0.452136 1.355059
H  0.783075 -2.642787 0.399432
H  1.488804 -1.624004 1.646401
H  3.621687 -2.093749 -1.87293
H  2.080308 -2.940722 -1.74795
H  3.27296 -3.238146 2.065051
H  1.708546 -4.029781 2.19373
H  3.920783 -4.524097 -1.455434
H  4.632013 -3.537029 -0.185771
H  3.37454 -5.391588 0.856772
H  1.941662 -4.975169 -0.063916
H  1.979339 2.22619 -1.113346
H  1.901307 2.814715 0.530341
H  4.293047 0.047463 0.920759
H  3.962743 1.729413 1.350743
H  4.266265 1.290535 -0.32794
H  -0.11127 2.023166 1.991321
H  -0.068028 1.726884 -2.265837
H  -2.528845 1.802633 1.986754
H  -2.484101 1.504446 -2.283271
H  -4.467397 0.463006 -2.033334
H  -5.925624 1.241706 -1.437334
H  -4.639447 2.219595 -2.129209
H  -4.618673 3.621605 0.007776
H  -5.946747 2.619785 0.597758
H  -4.507066 2.844241 1.582407
H  -4.248231 0.279452 1.721018
H  -5.68611 0.089526 0.725006
H  -4.167507 -0.669963 0.241596
totalener: -797.52987903 hartree
nucrepener: 1580.18425032 hartree
electener: -2377.71412935 hartree
oneelecener: -4215.28868645 hartree
twoeener: 1837.57455710 hartree
kineticenergy: 793.52932137 hartree
xcener: -82.788386314554 hartree
chargesum: -0.0000000
charge: -0.164045 -0.162528 0.089495 -0.098423 -0.091867 -0.136992 -0.133347 -0.107433 -0.160202 -0.278291 0.075132 0.258068 -0.067985 -0.219163 -0.179531 -0.150374 -0.115964 -0.336713 -0.289347 -0.290892 0.098179 0.076379 0.031032 0.070673 0.080779 0.067965 0.067514 0.062608 0.067942 0.067550 0.061961 0.068626 0.063062 0.082992 0.095363 0.091606 0.082030 0.070403 0.110262 0.105597 0.103634 0.115362 0.093829 0.089805 0.095180 0.098496 0.085752 0.085643 0.086391 0.085725 0.098063
qa: -0.1640 -0.1625 0.0895 -0.0984 -0.0919 -0.1370 -0.1333 -0.1074 -0.1602 -0.2783 0.0751 0.2581 -0.0680 -0.2192 -0.1795 -0.1504 -0.1160 -0.3367 -0.2893 -0.2909 0.0982 0.0764 0.0310 0.0707 0.0808 0.0680 0.0675 0.0626 0.0679 0.0675 0.0620 0.0686 0.0631 0.0830 0.0954 0.0916 0.0820 0.0704 0.1103 0.1056 0.1036 0.1154 0.0938 0.0898 0.0952 0.0985 0.0858 0.0856 0.0864 0.0857 0.0981
va: 2.8831 3.9524 3.7498 3.9285 3.9382 3.9323 3.9294 3.8602 3.8500 3.9178 3.6053 3.7590 3.7652 4.0821 4.0255 4.0572 3.9493 3.9312 3.9222 3.9223 1.0104 1.0055 1.0284 1.0166 1.0058 1.0076 1.0086 1.0185 1.0150 1.0148 1.0208 1.0155 1.0169 1.0146 1.0080 1.0339 1.0072 1.0062 1.0099 1.0143 1.0116 1.0056 1.0028 1.0118 1.0030 1.0066 1.0065 1.0085 1.0079 1.0066 1.0069
dispcorr: -0.023498277 hartree
energy: -797.553377304242
dipole: -0.67258 0.46535 -0.20723 -6.91429 6.76359 -0.15070 0.86600 -0.90435 -0.03835
magnitude: 0.25908 au
magnitude: 0.65854 debye
