program: Orca
programVersion: 5.0.2
elementType: N C C C C C C C C C C C C C C C C C C C H H H H H H H H H H H H H H H H H H H H H H H H H H H H H H H
charge: 0
multiplicity: 1
keywords: wb97x-d3
keywords: def2-TZVPP
keywords: def2/J RIJCOSX
keywords: DEFGRID2
keywords: scfconv7
keywords: smallprint printgap noloewdin
keywords: NOSOSCF
formula: C19H31N
InChI: InChI=1/C19H31N/c1-16(15-20-12-6-5-7-13-20)14-17-8-10-18(11-9-17)19(2,3)4/h8-11,16H,5-7,12-15H2,1-4H3
51 atoms
N  2.048223 -1.071724 -0.089741
C  3.266625 -0.302027 -0.129724
C  3.100168 1.164872 0.269922
C  2.081048 -2.246673 -0.932798
C  1.616824 -1.386451 1.254889
C  0.705789 -2.892504 -1.020695
C  0.227207 -2.002674 1.257805
C  0.177283 -3.235557 0.365773
C  2.096669 1.902941 -0.627756
C  4.460664 1.853667 0.216163
C  0.647567 1.549464 -0.430435
C  -3.544899 0.48572 0.131262
C  -2.088694 0.898801 -0.048526
C  -0.099297 0.945258 -1.435998
C  -0.006842 1.844436 0.75685
C  -1.432241 0.630872 -1.250955
C  -1.345323 1.522626 0.947065
C  -4.411723 1.169134 -0.933264
C  -4.089508 0.866949 1.507642
C  -3.654337 -1.038047 -0.019227
H  3.644435 -0.319728 -1.158317
H  4.062892 -0.754532 0.490738
H  2.745706 1.222601 1.304943
H  2.813292 -2.995187 -0.573008
H  2.409412 -1.948135 -1.932024
H  1.597717 -0.472035 1.850255
H  2.329793 -2.073042 1.752185
H  0.020047 -2.19499 -1.509798
H  0.762781 -3.786186 -1.646864
H  -0.055229 -2.25349 2.283221
H  -0.484129 -1.253923 0.900602
H  -0.840982 -3.626659 0.303608
H  0.791642 -4.030475 0.803251
H  2.375188 1.736881 -1.673646
H  2.215179 2.978176 -0.456519
H  5.192545 1.34353 0.844129
H  4.397255 2.887227 0.558474
H  4.855874 1.869644 -0.802402
H  0.377783 0.700836 -2.377655
H  0.532578 2.335579 1.55969
H  -1.96689 0.153165 -2.063697
H  -1.79965 1.769964 1.896797
H  -5.458351 0.877153 -0.822197
H  -4.354924 2.255113 -0.846949
H  -4.104882 0.903192 -1.945293
H  -4.061897 1.94509 1.674497
H  -5.130456 0.551506 1.595347
H  -3.536169 0.384062 2.314965
H  -4.688481 -1.36513 0.108901
H  -3.322493 -1.377856 -1.00102
H  -3.045135 -1.549736 0.727947
totalener: -797.52642583 hartree
nucrepener: 1695.11527883 hartree
electener: -2492.64170465 hartree
oneelecener: -4445.41135027 hartree
twoeener: 1952.76964561 hartree
kineticenergy: 793.53775648 hartree
xcener: -82.794733304466 hartree
chargesum: 0.0000000
charge: -0.130933 -0.172558 0.090887 -0.113831 -0.132240 -0.126999 -0.050899 -0.123988 -0.149037 -0.280391 0.172327 0.289538 -0.073181 -0.232810 -0.236984 -0.163377 -0.119246 -0.287581 -0.340520 -0.307151 0.075463 0.072240 0.033504 0.071153 0.069557 0.085285 0.076836 0.060732 0.073161 0.072758 0.001667 0.068324 0.067786 0.074915 0.101920 0.084358 0.082793 0.080827 0.095460 0.106892 0.104222 0.111106 0.085407 0.097829 0.086343 0.094759 0.089481 0.093468 0.091209 0.088801 0.090719
qa: -0.1309 -0.1726 0.0909 -0.1138 -0.1322 -0.1270 -0.0509 -0.1240 -0.1490 -0.2804 0.1723 0.2895 -0.0732 -0.2328 -0.2370 -0.1634 -0.1192 -0.2876 -0.3405 -0.3072 0.0755 0.0722 0.0335 0.0712 0.0696 0.0853 0.0768 0.0607 0.0732 0.0728 0.0017 0.0683 0.0678 0.0749 0.1019 0.0844 0.0828 0.0808 0.0955 0.1069 0.1042 0.1111 0.0854 0.0978 0.0863 0.0948 0.0895 0.0935 0.0912 0.0888 0.0907
va: 2.8407 3.9741 3.7443 3.9395 3.9414 3.9148 3.8937 3.8867 3.8116 3.9547 3.5543 3.7259 3.7121 4.0968 4.0371 3.9926 3.8791 3.9183 3.9356 3.9345 1.0061 1.0139 1.0221 1.0114 1.0064 1.0057 1.0208 1.0224 1.0158 1.0157 1.0565 1.0152 1.0172 1.0166 1.0010 1.0084 1.0074 1.0041 1.0147 1.0107 1.0121 1.0083 1.0065 1.0068 1.0076 1.0032 1.0120 1.0024 1.0103 1.0066 1.0061
dispcorr: -0.029005545 hartree
energy: -797.555431370372
dipole: -1.54469 1.67889 0.13420 -5.67876 5.55574 -0.12302 2.08409 -2.02150 0.06258
magnitude: 0.19251 au
magnitude: 0.48933 debye
