program: Orca
programVersion: 5.0.2
elementType: N C C C C C C C C C C C C C C C C C C C H H H H H H H H H H H H H H H H H H H H H H H H H H H H H H H
charge: 0
multiplicity: 1
keywords: wb97x-d3
keywords: def2-TZVPP
keywords: def2/J RIJCOSX
keywords: DEFGRID2
keywords: scfconv7
keywords: smallprint printgap noloewdin
keywords: NOSOSCF
formula: C19H31N
InChI: InChI=1/C19H31N/c1-16(15-20-12-6-5-7-13-20)14-17-8-10-18(11-9-17)19(2,3)4/h8-11,16H,5-7,12-15H2,1-4H3
51 atoms
N  1.942946 -1.003467 -0.313993
C  3.170475 -0.248105 -0.380149
C  3.145612 1.063123 0.408364
C  1.7263 -1.865571 -1.454684
C  1.771513 -1.710556 0.93559
C  0.321031 -2.448095 -1.435769
C  0.373138 -2.298075 1.050005
C  0.063373 -3.199609 -0.137204
C  2.134331 2.071845 -0.155721
C  4.541579 1.678627 0.411161
C  0.687936 1.674048 -0.057035
C  -3.470691 0.390449 0.206532
C  -2.027494 0.877716 0.142359
C  -0.073894 1.415845 -1.190574
C  0.056207 1.566225 1.173438
C  -1.396557 1.025425 -1.093271
C  -1.271474 1.171336 1.272614
C  -3.547774 -1.016435 -0.402558
C  -4.375587 1.342298 -0.585281
C  -3.995577 0.320378 1.64005
H  3.362187 0.001859 -1.42966
H  4.039868 -0.848145 -0.053335
H  2.875378 0.852137 1.449048
H  2.463263 -2.690866 -1.497539
H  1.864342 -1.277398 -2.365734
H  1.937714 -1.020867 1.765738
H  2.521322 -2.518784 1.044654
H  -0.395768 -1.62782 -1.530151
H  0.185009 -3.103748 -2.299259
H  0.28643 -2.848567 1.989989
H  -0.345635 -1.475167 1.086865
H  -0.969942 -3.55259 -0.095086
H  0.698837 -4.091404 -0.097121
H  2.3880 2.27221 -1.202317
H  2.275556 3.022355 0.369511
H  5.277635 1.000072 0.844544
H  4.568559 2.604931 0.986484
H  4.87111 1.91578 -0.603471
H  0.383229 1.50139 -2.169724
H  0.608458 1.78425 2.081181
H  -1.942392 0.821229 -2.007064
H  -1.709147 1.092231 2.258582
H  -3.230313 -1.026634 -1.445935
H  -2.90755 -1.713852 0.141157
H  -4.569968 -1.399368 -0.366676
H  -5.413607 1.00437 -0.549088
H  -4.336896 2.35229 -0.174872
H  -4.090095 1.403223 -1.635877
H  -5.028709 -0.030538 1.640099
H  -3.418823 -0.372466 2.255268
H  -3.98402 1.296933 2.127283
totalener: -797.52591896 hartree
nucrepener: 1702.65354876 hartree
electener: -2500.17946772 hartree
oneelecener: -4460.49849360 hartree
twoeener: 1960.31902588 hartree
kineticenergy: 793.53691951 hartree
xcener: -82.794513407917 hartree
chargesum: 0.0000000
charge: -0.131364 -0.174729 0.094393 -0.112787 -0.123377 -0.109669 -0.086118 -0.144257 -0.156653 -0.279357 0.195572 0.302362 -0.045139 -0.226598 -0.234967 -0.203534 -0.144332 -0.310903 -0.291572 -0.337364 0.076992 0.073988 0.029190 0.075542 0.070946 0.084894 0.073671 0.052900 0.072258 0.071076 0.033920 0.071828 0.071476 0.076859 0.100312 0.083963 0.082963 0.080876 0.096950 0.103737 0.107483 0.110886 0.088902 0.088377 0.092757 0.086217 0.098105 0.086077 0.089450 0.092315 0.095482
qa: -0.1314 -0.1747 0.0944 -0.1128 -0.1234 -0.1097 -0.0861 -0.1443 -0.1567 -0.2794 0.1956 0.3024 -0.0451 -0.2266 -0.2350 -0.2035 -0.1443 -0.3109 -0.2916 -0.3374 0.0770 0.0740 0.0292 0.0755 0.0709 0.0849 0.0737 0.0529 0.0723 0.0711 0.0339 0.0718 0.0715 0.0769 0.1003 0.0840 0.0830 0.0809 0.0969 0.1037 0.1075 0.1109 0.0889 0.0884 0.0928 0.0862 0.0981 0.0861 0.0895 0.0923 0.0955
va: 2.8318 3.9713 3.7516 3.9374 3.9254 3.8975 3.9050 3.8898 3.8030 3.9544 3.5506 3.6960 3.6513 4.0758 4.0382 4.0257 3.8882 3.9394 3.9224 3.9356 1.0057 1.0129 1.0251 1.0123 1.0061 1.0036 1.0204 1.0303 1.0169 1.0174 1.0406 1.0122 1.0186 1.0161 1.0029 1.0090 1.0074 1.0036 1.0130 1.0117 1.0111 1.0089 1.0047 1.0058 1.0122 1.0063 1.0066 1.0075 1.0120 1.0016 1.0035
dispcorr: -0.029515912 hartree
energy: -797.555434868774
dipole: -1.55737 1.69691 0.13954 -6.36895 6.22950 -0.13945 0.45167 -0.43428 0.01739
magnitude: 0.19804 au
magnitude: 0.50339 debye
