program: Orca
programVersion: 5.0.2
elementType: N C C C C C C C C C C C C C C C C C C C H H H H H H H H H H H H H H H H H H H H H H H H H H H H H H H
charge: 0
multiplicity: 1
keywords: wb97x-d3
keywords: def2-TZVPP
keywords: def2/J RIJCOSX
keywords: DEFGRID2
keywords: scfconv7
keywords: smallprint printgap noloewdin
keywords: NOSOSCF
formula: C19H31N
InChI: InChI=1/C19H31N/c1-16(15-20-12-6-5-7-13-20)14-17-8-10-18(11-9-17)19(2,3)4/h8-11,16H,5-7,12-15H2,1-4H3
51 atoms
N  1.940655 -1.021731 -0.110414
C  3.163554 -0.280928 -0.300684
C  3.143683 1.122538 0.308244
C  1.685886 -2.005483 -1.138598
C  1.808929 -1.575095 1.21845
C  0.285809 -2.585079 -1.002527
C  0.41712 -2.145799 1.443895
C  0.080019 -3.183679 0.382437
C  2.138358 2.05131 -0.387059
C  4.541793 1.729025 0.237603
C  0.692065 1.654158 -0.282488
C  -3.474231 0.398248 0.04873
C  -2.036476 0.893876 -0.077989
C  -0.046653 1.303726 -1.402966
C  0.03287 1.650592 0.941183
C  -1.377715 0.928877 -1.304213
C  -1.295787 1.272307 1.041959
C  -4.261153 0.602562 -1.249042
C  -4.223579 1.132278 1.165922
C  -3.438004 -1.101682 0.373538
H  3.33777 -0.173661 -1.3770
H  4.040208 -0.82994 0.0898
H  2.86829 1.048597 1.366252
H  2.426085 -2.828558 -1.119197
H  1.783939 -1.519872 -2.112909
H  1.996363 -0.789929 1.953926
H  2.565403 -2.362843 1.403254
H  -0.438449 -1.781879 -1.164706
H  0.124272 -3.335834 -1.779837
H  0.358801 -2.57851 2.445584
H  -0.305869 -1.327141 1.397722
H  -0.947128 -3.536461 0.501252
H  0.727779 -4.058931 0.504022
H  2.416024 2.136669 -1.443152
H  2.259992 3.055809 0.032081
H  5.271389 1.114013 0.76617
H  4.567662 2.72529 0.680693
H  4.879606 1.822603 -0.797338
H  0.429201 1.308057 -2.377006
H  0.565766 1.942415 1.839647
H  -1.89877 0.656929 -2.212344
H  -1.75475 1.277043 2.022006
H  -5.299986 0.3003 -1.106373
H  -4.258369 1.648587 -1.559689
H  -3.871404 0.005432 -2.073884
H  -4.220928 2.211377 1.005738
H  -5.26325 0.801851 1.198972
H  -3.801573 0.938983 2.152143
H  -4.448553 -1.505229 0.471741
H  -2.92719 -1.662328 -0.411367
H  -2.909073 -1.29183 1.309089
totalener: -797.52484418 hartree
nucrepener: 1702.95568028 hartree
electener: -2500.48052446 hartree
oneelecener: -4461.11068836 hartree
twoeener: 1960.63016391 hartree
kineticenergy: 793.53901109 hartree
xcener: -82.795019689343 hartree
chargesum: -0.0000000
charge: -0.132332 -0.175047 0.096721 -0.113511 -0.126157 -0.110731 -0.087674 -0.129221 -0.160515 -0.279720 0.195623 0.277195 0.034377 -0.196606 -0.245614 -0.219959 -0.209591 -0.308548 -0.304155 -0.341111 0.077319 0.074256 0.028453 0.077041 0.070844 0.083508 0.073014 0.045371 0.072173 0.071383 0.035182 0.070711 0.070526 0.076317 0.100109 0.084059 0.083010 0.080972 0.095749 0.104188 0.114541 0.113686 0.087742 0.109536 0.082303 0.106056 0.086493 0.084120 0.095320 0.090386 0.092207
qa: -0.1323 -0.1750 0.0967 -0.1135 -0.1262 -0.1107 -0.0877 -0.1292 -0.1605 -0.2797 0.1956 0.2772 0.0344 -0.1966 -0.2456 -0.2200 -0.2096 -0.3085 -0.3042 -0.3411 0.0773 0.0743 0.0285 0.0770 0.0708 0.0835 0.0730 0.0454 0.0722 0.0714 0.0352 0.0707 0.0705 0.0763 0.1001 0.0841 0.0830 0.0810 0.0957 0.1042 0.1145 0.1137 0.0877 0.1095 0.0823 0.1061 0.0865 0.0841 0.0953 0.0904 0.0922
va: 2.8297 3.9700 3.7505 3.9390 3.9360 3.9105 3.8987 3.8789 3.8003 3.9545 3.5591 3.7220 3.6324 4.0405 4.0335 3.9934 3.9813 3.9135 3.9149 3.9602 1.0058 1.0128 1.0258 1.0120 1.0055 1.0026 1.0200 1.0325 1.0174 1.0167 1.0376 1.0128 1.0191 1.0155 1.0026 1.0088 1.0074 1.0038 1.0136 1.0103 1.0083 1.0092 1.0093 1.0037 1.0050 1.0045 1.0081 1.0066 1.0118 1.0034 1.0019
dispcorr: -0.029660660 hartree
energy: -797.554504837828
dipole: -1.55146 1.68025 0.12879 -6.33708 6.19614 -0.14094 1.47688 -1.42953 0.04735
magnitude: 0.19671 au
magnitude: 0.49999 debye
