program: Orca
programVersion: 4.2.1
elementType: Cl N N N N C C C C C C C C C C C C C C C C C C C H H H H H H H H H H H H H H H H H
charge: 0
multiplicity: 1
keywords: wb97x-d3
keywords: def2-TZVPP
keywords: def2/J RIJCOSX GRIDX6 NOFINALGRIDX
keywords: grid4 nofinalgrid
keywords: scfconv7
keywords: smallprint printgap noloewdin
keywords: NOSOSCF
formula: C19H17ClN4
InChI: InChI=1/C19H17ClN4/c20-18-8-6-16(7-9-18)10-11-19(12-21,13-24-15-22-14-23-24)17-4-2-1-3-5-17/h1-9,14-15H,10-11,13H2
41 atoms
Cl 5.172862 -0.97401 -0.760313
N  -3.830353 0.656005 0.175589
N  -4.294253 0.801444 1.421812
N  -5.730185 -0.399492 0.185677
N  -1.969528 -2.065359 -1.004712
C  -1.343324 0.25198 0.026604
C  -1.111847 0.052851 1.544211
C  -2.559333 1.184934 -0.244577
C  -0.133929 0.881898 -0.66216
C  -0.201558 -1.111187 1.938879
C  1.162535 -1.10809 1.306966
C  -1.66548 -1.046081 -0.564033
C  0.578237 0.241037 -1.668052
C  0.271435 2.152757 -0.260364
C  2.04585 -0.053415 1.525801
C  1.563791 -2.139927 0.467439
C  1.68724 0.844992 -2.243082
C  1.369808 2.762321 -0.844739
C  -4.695681 -0.063918 -0.543002
C  2.08746 2.106918 -1.835188
C  3.278529 -0.007261 0.900862
C  2.800318 -2.117829 -0.163267
C  -5.428886 0.155289 1.375038
C  3.641024 -1.04178 0.051887
H  -2.072954 -0.108198 2.032793
H  -0.724284 0.992859 1.94088
H  -2.402751 2.133155 0.265049
H  -2.620655 1.389744 -1.312024
H  -0.701937 -2.056136 1.717475
H  -0.104375 -1.07529 3.026606
H  0.292428 -0.746643 -2.0040
H  -0.25513 2.678773 0.526211
H  1.76397 0.760916 2.1815
H  0.897398 -2.973581 0.282316
H  2.24081 0.3199 -3.009829
H  1.668884 3.748604 -0.516826
H  -4.540944 -0.299154 -1.584029
H  2.952929 2.576498 -2.283744
H  3.943685 0.828568 1.066892
H  3.09239 -2.924434 -0.821629
H  -6.072533 0.085613 2.237288
elementType: Cl N C H
totalener: -1413.53047901 hartree
nucrepener: 2141.68297604 hartree
electener: -3555.21345504 hartree
oneelecener: -6182.83549014 hartree
twoeener: 2627.62203509 hartree
cpcmener: -0.03432231 hartree
kineticenergy: 1408.78129395 hartree
xcener: -115.439928469181 hartree
chargesum: 0.0000000
charge: -0.115038 0.111224 -0.367940 -0.418347 -0.072994 0.806149 -0.190309 -0.144270 -0.172543 -0.117870 0.085093 -0.429668 -0.144545 -0.257292 -0.190999 -0.228658 -0.155470 -0.170892 0.062668 -0.153375 -0.167370 -0.131524 0.083862 0.116851 0.110974 0.117928 0.140426 0.158698 0.100596 0.111027 0.131621 0.135598 0.135163 0.129878 0.147837 0.159505 0.186037 0.157055 0.135604 0.140734 0.164577
qa: -0.1150 0.1112 -0.3679 -0.4183 -0.0730 0.8061 -0.1903 -0.1443 -0.1725 -0.1179 0.0851 -0.4297 -0.1445 -0.2573 -0.1910 -0.2287 -0.1555 -0.1709 0.0627 -0.1534 -0.1674 -0.1315 0.0839 0.1169 0.1110 0.1179 0.1404 0.1587 0.1006 0.1110 0.1316 0.1356 0.1352 0.1299 0.1478 0.1595 0.1860 0.1571 0.1356 0.1407 0.1646
va: 1.1898 3.3553 2.8681 3.0302 3.1086 3.2230 3.8304 3.8443 3.6212 3.8295 3.5170 4.1194 3.8399 3.9975 3.9547 3.9432 3.8872 3.9082 4.0561 3.8754 3.9346 3.9687 4.0197 3.7532 1.0416 0.9999 1.0061 0.9951 1.0093 1.0031 1.0188 1.0131 1.0042 1.0121 0.9980 0.9905 0.9902 0.9901 1.0098 1.0060 0.9932
dispcorr: -0.026899393 hartree
energy: -1413.557378401449
dipole: -9.47811 10.41561 0.93749 7.16771 -4.98479 2.18292 5.01446 -4.63397 0.38049
magnitude: 2.40600 au
magnitude: 6.11555 debye
