program: Orca
programVersion: 4.2.1
elementType: Cl N N N N C C C C C C C C C C C C C C C C C C C H H H H H H H H H H H H H H H H H
charge: 0
multiplicity: 1
keywords: wb97x-d3
keywords: def2-TZVPP
keywords: def2/J RIJCOSX GRIDX6 NOFINALGRIDX
keywords: grid4 nofinalgrid
keywords: scfconv7
keywords: smallprint printgap noloewdin
keywords: NOSOSCF
formula: C19H17ClN4
InChI: InChI=1/C19H17ClN4/c20-18-8-6-16(7-9-18)10-11-19(12-21,13-24-15-22-14-23-24)17-4-2-1-3-5-17/h1-9,14-15H,10-11,13H2
41 atoms
Cl 4.827963 -1.739651 -1.908658
N  -3.277315 0.137193 -0.603935
N  -3.903631 1.258861 -0.234878
N  -3.712675 1.167593 -2.468757
N  -0.010288 -1.280725 -1.564768
C  -1.190055 -0.466318 0.623036
C  -0.750104 -1.348975 1.813965
C  -2.697296 -0.748619 0.371561
C  -0.985055 1.021633 0.859596
C  0.649586 -1.078705 2.365577
C  1.738643 -1.240481 1.344988
C  -0.482602 -0.903316 -0.584701
C  -1.426043 1.581985 2.055729
C  -0.439692 1.853947 -0.110199
C  2.37754 -0.134696 0.79459
C  2.095172 -2.506833 0.887783
C  -1.313854 2.944571 2.279562
C  -0.330112 3.220415 0.111773
C  -3.163582 0.104708 -1.934655
C  -0.765558 3.770497 1.306672
C  3.32874 -0.276827 -0.20509
C  3.042718 -2.67024 -0.108112
C  -4.144932 1.835177 -1.381817
C  3.645642 -1.546934 -0.653641
H  -0.837897 -2.395842 1.514572
H  -1.470309 -1.208078 2.621786
H  -2.840449 -1.780194 0.052809
H  -3.241445 -0.610432 1.303047
H  0.80599 -1.77648 3.190607
H  0.691759 -0.077972 2.797475
H  -1.868333 0.960809 2.824972
H  -0.090402 1.450414 -1.052148
H  2.127567 0.860381 1.140905
H  1.620451 -3.385824 1.307907
H  -1.658553 3.36221 3.216316
H  0.098111 3.851763 -0.655613
H  -2.704686 -0.711999 -2.468811
H  -0.678498 4.834692 1.48132
H  3.811959 0.594826 -0.62518
H  3.306917 -3.660712 -0.453107
H  -4.664851 2.778575 -1.438863
elementType: Cl N C H
totalener: -1413.53132597 hartree
nucrepener: 2134.12054166 hartree
electener: -3547.65186763 hartree
oneelecener: -6168.63788457 hartree
twoeener: 2620.98601694 hartree
cpcmener: -0.03921861 hartree
kineticenergy: 1408.77423171 hartree
xcener: -115.435991504578 hartree
chargesum: -0.0000000
charge: -0.108966 0.107648 -0.331025 -0.407300 -0.061623 0.810449 -0.234621 -0.112176 -0.150650 -0.095376 -0.004279 -0.461917 -0.260451 -0.215924 -0.145955 -0.174860 -0.154802 -0.142794 0.058637 -0.158663 -0.175866 -0.172030 0.056210 0.125048 0.125919 0.106730 0.157976 0.130469 0.112030 0.103410 0.143856 0.135081 0.143556 0.139080 0.163388 0.161931 0.172270 0.163754 0.143610 0.145004 0.163225
qa: -0.1090 0.1076 -0.3310 -0.4073 -0.0616 0.8104 -0.2346 -0.1122 -0.1507 -0.0954 -0.0043 -0.4619 -0.2605 -0.2159 -0.1460 -0.1749 -0.1548 -0.1428 0.0586 -0.1587 -0.1759 -0.1720 0.0562 0.1250 0.1259 0.1067 0.1580 0.1305 0.1120 0.1034 0.1439 0.1351 0.1436 0.1391 0.1634 0.1619 0.1723 0.1638 0.1436 0.1450 0.1632
va: 1.1960 3.3911 2.8911 3.0327 3.1237 3.2523 3.8916 3.8505 3.5670 3.8637 3.5784 4.1340 3.9497 3.8252 3.8929 3.9480 3.9250 3.9047 4.0655 3.9042 4.0208 3.9982 4.0469 3.7894 1.0040 1.0105 0.9980 1.0105 1.0051 1.0090 1.0071 1.0239 0.9913 1.0036 0.9887 0.9894 1.0018 0.9866 1.0053 1.0033 0.9956
dispcorr: -0.025785026 hartree
energy: -1413.557110998221
dipole: -13.70870 12.84012 -0.86858 5.22112 -5.78933 -0.56821 16.50614 -13.31412 3.19202
magnitude: 3.35653 au
magnitude: 8.53161 debye
