program: Orca
programVersion: 4.2.1
elementType: Cl N N N N C C C C C C C C C C C C C C C C C C C H H H H H H H H H H H H H H H H H
charge: 0
multiplicity: 1
keywords: wb97x-d3
keywords: def2-TZVPP
keywords: def2/J RIJCOSX GRIDX6 NOFINALGRIDX
keywords: grid4 nofinalgrid
keywords: scfconv7
keywords: smallprint printgap noloewdin
keywords: NOSOSCF
formula: C19H17ClN4
InChI: InChI=1/C19H17ClN4/c20-18-8-6-16(7-9-18)10-11-19(12-21,13-24-15-22-14-23-24)17-4-2-1-3-5-17/h1-9,14-15H,10-11,13H2
41 atoms
Cl 6.503648 -1.574955 2.459875
N  -3.288371 1.024014 0.362293
N  -4.19447 0.080268 0.637632
N  -5.141266 1.774936 -0.488843
N  -2.062685 -2.382971 -0.605904
C  -1.149059 0.064008 -0.469313
C  0.355161 -0.043053 -0.123769
C  -1.892389 0.833939 0.650883
C  -1.37427 0.791834 -1.791022
C  0.666478 -0.847285 1.130911
C  2.137762 -1.001826 1.423125
C  -1.684251 -1.297253 -0.544946
C  -2.302212 0.347113 -2.726844
C  -0.714663 1.997638 -2.024104
C  2.529951 -1.875287 2.438378
C  3.13205 -0.309275 0.740371
C  -2.558785 1.084641 -3.875189
C  -0.970777 2.733407 -3.170941
C  -3.864961 2.015059 -0.32144
C  -1.894993 2.279828 -4.102038
C  3.862367 -2.057048 2.765998
C  4.475515 -0.478872 1.053525
C  -5.282399 0.577978 0.112389
C  4.830169 -1.352749 2.06455
H  0.738351 0.971504 -0.009028
H  0.863346 -0.480344 -0.985182
H  -1.810552 0.321947 1.606716
H  -1.425998 1.812136 0.759726
H  0.231591 -1.847475 1.055882
H  0.197978 -0.385459 2.003874
H  -2.843237 -0.578357 -2.575707
H  0.000169 2.38539 -1.310399
H  1.777904 -2.429275 2.98738
H  2.882233 0.381299 -0.053973
H  -3.284195 0.720263 -4.590308
H  -0.447374 3.666294 -3.33271
H  -3.328849 2.889712 -0.655149
H  -2.096888 2.856034 -4.99513
H  4.140212 -2.741099 3.556326
H  5.23027 0.069778 0.506827
H  -6.225385 0.058064 0.175688
elementType: Cl N C H
totalener: -1413.53253384 hartree
nucrepener: 2003.09751858 hartree
electener: -3416.63005242 hartree
oneelecener: -5905.26435866 hartree
twoeener: 2488.63430624 hartree
cpcmener: -0.04310646 hartree
kineticenergy: 1408.74747692 hartree
xcener: -115.430897355322 hartree
chargesum: 0.0000000
charge: -0.106920 0.123102 -0.349225 -0.405975 -0.076959 0.757462 -0.197415 -0.140314 -0.205661 -0.052197 0.032208 -0.376255 -0.162094 -0.218161 -0.218032 -0.208881 -0.155060 -0.172594 0.049012 -0.142008 -0.171959 -0.182455 0.067178 0.111030 0.100201 0.124530 0.144556 0.151981 0.098582 0.101525 0.135905 0.144344 0.141767 0.142342 0.162120 0.162790 0.174251 0.164076 0.144745 0.144208 0.164249
qa: -0.1069 0.1231 -0.3492 -0.4060 -0.0770 0.7575 -0.1974 -0.1403 -0.2057 -0.0522 0.0322 -0.3763 -0.1621 -0.2182 -0.2180 -0.2089 -0.1551 -0.1726 0.0490 -0.1420 -0.1720 -0.1825 0.0672 0.1110 0.1002 0.1245 0.1446 0.1520 0.0986 0.1015 0.1359 0.1443 0.1418 0.1423 0.1621 0.1628 0.1743 0.1641 0.1447 0.1442 0.1642
va: 1.1984 3.3739 2.8896 3.0190 3.1176 3.4592 3.9284 3.8732 3.5701 3.7844 3.6546 4.1203 3.8523 3.9791 4.0202 3.9608 3.9368 3.9296 4.0788 3.8889 3.9947 4.0426 4.0401 3.7974 1.0024 0.9993 1.0131 0.9908 1.0148 1.0049 1.0197 1.0112 1.0038 1.0050 0.9907 0.9910 0.9940 0.9874 1.0054 1.0072 0.9944
dispcorr: -0.021851956 hartree
energy: -1413.554385793823
dipole: -13.83332 15.09965 1.26632 9.29385 -6.80995 2.48390 -8.73767 8.64611 -0.09156
magnitude: 2.78957 au
magnitude: 7.09053 debye
