program: Orca
programVersion: 4.2.1
elementType: Cl N N N N C C C C C C C C C C C C C C C C C C C H H H H H H H H H H H H H H H H H
charge: 0
multiplicity: 1
keywords: wb97x-d3
keywords: def2-TZVPP
keywords: def2/J RIJCOSX GRIDX6 NOFINALGRIDX
keywords: grid4 nofinalgrid
keywords: scfconv7
keywords: smallprint printgap noloewdin
keywords: NOSOSCF
formula: C19H17ClN4
InChI: InChI=1/C19H17ClN4/c20-18-8-6-16(7-9-18)10-11-19(12-21,13-24-15-22-14-23-24)17-4-2-1-3-5-17/h1-9,14-15H,10-11,13H2
41 atoms
Cl 5.04779 0.74423 -0.405001
N  -3.459168 0.669615 0.362991
N  -4.313209 0.133561 -0.514286
N  -3.966448 2.302003 -0.979772
N  -2.309313 -2.672253 -0.973061
C  -1.510774 -0.838867 0.711987
C  -0.816411 -1.611891 1.859006
C  -2.754434 -0.13919 1.319409
C  -0.645089 0.21157 0.028005
C  0.355162 -2.516665 1.468759
C  1.573999 -1.776105 0.996253
C  -1.962966 -1.840502 -0.25617
C  0.131213 1.06778 0.803875
C  -0.674317 0.398367 -1.348654
C  2.414314 -1.148649 1.911164
C  1.858105 -1.643014 -0.358309
C  0.89693 2.057557 0.211058
C  0.085301 1.396836 -1.942927
C  -3.252392 1.953186 0.060906
C  0.881886 2.222971 -1.16717
C  3.490072 -0.381331 1.492748
C  2.923451 -0.87391 -0.798907
C  -4.589191 1.148916 -1.289188
C  3.725902 -0.240985 0.135018
H  -1.576543 -2.230727 2.340928
H  -0.494628 -0.892004 2.613705
H  -3.443153 -0.869987 1.739665
H  -2.41939 0.505957 2.130388
H  0.035973 -3.238436 0.713483
H  0.60622 -3.101625 2.355966
H  0.158819 0.965162 1.880699
H  -1.282076 -0.236852 -1.981213
H  2.223067 -1.245949 2.973449
H  1.227469 -2.129513 -1.092425
H  1.510191 2.698858 0.829927
H  0.053908 1.521606 -3.017309
H  -2.595839 2.591694 0.630727
H  1.483469 2.994225 -1.629771
H  4.128665 0.104732 2.217862
H  3.116039 -0.765478 -1.857318
H  -5.279241 1.056415 -2.113098
elementType: Cl N C H
totalener: -1413.53151337 hartree
nucrepener: 2175.24635329 hartree
electener: -3588.77786666 hartree
oneelecener: -6250.12053346 hartree
twoeener: 2661.34266679 hartree
cpcmener: -0.04087180 hartree
kineticenergy: 1408.78488654 hartree
xcener: -115.440629267905 hartree
chargesum: -0.0000000
charge: -0.113022 0.123554 -0.354579 -0.405421 -0.073925 0.702851 -0.213000 -0.118002 -0.208844 -0.112066 0.095439 -0.389195 -0.195577 -0.129218 -0.244575 -0.179626 -0.161331 -0.162237 0.055014 -0.140328 -0.137507 -0.161042 0.066792 0.107786 0.118284 0.112291 0.141655 0.147206 0.100634 0.109868 0.136629 0.128869 0.138855 0.136045 0.150537 0.158879 0.171737 0.156417 0.142042 0.135120 0.162991
qa: -0.1130 0.1236 -0.3546 -0.4054 -0.0739 0.7029 -0.2130 -0.1180 -0.2088 -0.1121 0.0954 -0.3892 -0.1956 -0.1292 -0.2446 -0.1796 -0.1613 -0.1622 0.0550 -0.1403 -0.1375 -0.1610 0.0668 0.1078 0.1183 0.1123 0.1417 0.1472 0.1006 0.1099 0.1366 0.1289 0.1389 0.1360 0.1505 0.1589 0.1717 0.1564 0.1420 0.1351 0.1630
va: 1.1916 3.3668 2.8850 3.0192 3.1109 3.4800 3.8996 3.8615 3.5471 3.8503 3.4963 4.1311 3.9388 3.7849 3.9731 3.9349 3.8921 3.9233 4.0765 3.8685 3.9575 3.9404 4.0411 3.7589 1.0126 1.0039 1.0138 0.9916 1.0153 1.0038 1.0107 1.0198 1.0038 1.0043 0.9956 0.9903 0.9960 0.9896 1.0043 1.0095 0.9950
dispcorr: -0.028034529 hartree
energy: -1413.559547901958
dipole: -9.46849 10.38387 0.91538 -3.10557 3.64184 0.53627 8.24729 -5.27210 2.97519
magnitude: 3.15868 au
magnitude: 8.02872 debye
