program: Orca
programVersion: 4.2.1
elementType: Cl N N N N C C C C C C C C C C C C C C C C C C C H H H H H H H H H H H H H H H H H
charge: 0
multiplicity: 1
keywords: wb97x-d3
keywords: def2-TZVPP
keywords: def2/J RIJCOSX GRIDX6 NOFINALGRIDX
keywords: grid4 nofinalgrid
keywords: scfconv7
keywords: smallprint printgap noloewdin
keywords: NOSOSCF
formula: C19H17ClN4
InChI: InChI=1/C19H17ClN4/c20-18-8-6-16(7-9-18)10-11-19(12-21,13-24-15-22-14-23-24)17-4-2-1-3-5-17/h1-9,14-15H,10-11,13H2
41 atoms
Cl 5.063472 -0.141762 3.844953
N  -3.238187 0.847438 0.438673
N  -4.306399 0.051113 0.531713
N  -3.773241 0.882679 2.539783
N  -2.498123 -2.385114 -0.952891
C  -1.46849 0.009498 -1.134123
C  -0.330074 0.077259 -0.091248
C  -2.572764 1.053642 -0.820636
C  -0.959172 0.290349 -2.544495
C  0.834475 -0.870439 -0.376026
C  1.908259 -0.714959 0.663544
C  -2.057185 -1.328376 -1.052861
C  -1.194152 -0.572682 -3.608788
C  -0.246956 1.465918 -2.779408
C  2.967169 0.166621 0.467641
C  1.844238 -1.412943 1.866479
C  -0.720262 -0.273035 -4.879645
C  0.224487 1.764923 -4.048033
C  -2.932162 1.337115 1.645865
C  -0.008539 0.894281 -5.104173
C  3.94127 0.349603 1.437982
C  2.807515 -1.243473 2.84931
C  -4.591836 0.101234 1.806124
C  3.851207 -0.359676 2.62479
H  -0.735658 -0.144676 0.89822
H  0.034668 1.106095 -0.051362
H  -2.119919 2.043884 -0.81178
H  -3.327575 1.041525 -1.604213
H  1.248068 -0.667518 -1.365625
H  0.480345 -1.904243 -0.389142
H  -1.745911 -1.492729 -3.464391
H  -0.044425 2.161587 -1.974095
H  3.042799 0.7217 -0.460059
H  1.031904 -2.107667 2.045163
H  -0.910006 -0.960976 -5.693187
H  0.777617 2.680997 -4.209049
H  -2.109466 2.014287 1.816406
H  0.363003 1.125536 -6.093872
H  4.760052 1.035276 1.265429
H  2.742703 -1.797498 3.776168
H  -5.426075 -0.440585 2.223957
elementType: Cl N C H
totalener: -1413.54370077 hartree
nucrepener: 2010.26587342 hartree
electener: -3423.80957420 hartree
oneelecener: -5919.65910495 hartree
twoeener: 2495.84953075 hartree
cpcmener: -0.03571340 hartree
kineticenergy: 1408.73132392 hartree
xcener: -115.422840315282 hartree
chargesum: -0.0000000
charge: -0.102828 0.095911 -0.338337 -0.408414 -0.052838 0.741937 -0.312869 -0.129113 -0.217056 -0.041650 0.050780 -0.379829 -0.139502 -0.220829 -0.214065 -0.224857 -0.156787 -0.167522 0.054750 -0.146210 -0.146366 -0.142777 0.074845 0.084515 0.138910 0.125518 0.148138 0.146166 0.101179 0.107866 0.136458 0.138996 0.138601 0.142064 0.159871 0.159842 0.184207 0.161768 0.143153 0.143867 0.162506
qa: -0.1028 0.0959 -0.3383 -0.4084 -0.0528 0.7419 -0.3129 -0.1291 -0.2171 -0.0416 0.0508 -0.3798 -0.1395 -0.2208 -0.2141 -0.2249 -0.1568 -0.1675 0.0547 -0.1462 -0.1464 -0.1428 0.0748 0.0845 0.1389 0.1255 0.1481 0.1462 0.1012 0.1079 0.1365 0.1390 0.1386 0.1421 0.1599 0.1598 0.1842 0.1618 0.1432 0.1439 0.1625
va: 1.2023 3.3670 2.8857 3.0315 3.1183 3.3618 3.8900 3.8623 3.6525 3.7326 3.5689 4.1195 3.9035 3.9778 3.9938 4.0010 3.9345 3.9465 4.0572 3.8960 3.9810 3.9759 4.0306 3.8309 1.0013 1.0042 0.9943 1.0132 1.0145 1.0165 1.0192 1.0129 1.0055 1.0046 0.9929 0.9920 0.9868 0.9889 1.0051 1.0047 0.9938
dispcorr: -0.021349367 hartree
energy: -1413.565050141710
dipole: -8.67389 9.87642 1.20253 4.33802 -2.12336 2.21465 -18.40400 16.39329 -2.01072
magnitude: 3.22393 au
magnitude: 8.19459 debye
