program: Orca
programVersion: 4.2.1
elementType: Cl N N N N C C C C C C C C C C C C C C C C C C C H H H H H H H H H H H H H H H H H
charge: 0
multiplicity: 1
keywords: wb97x-d3
keywords: def2-TZVPP
keywords: def2/J RIJCOSX GRIDX6 NOFINALGRIDX
keywords: grid4 nofinalgrid
keywords: scfconv7
keywords: smallprint printgap noloewdin
keywords: NOSOSCF
formula: C19H17ClN4
InChI: InChI=1/C19H17ClN4/c20-18-8-6-16(7-9-18)10-11-19(12-21,13-24-15-22-14-23-24)17-4-2-1-3-5-17/h1-9,14-15H,10-11,13H2
41 atoms
Cl 5.073453 -0.898475 3.625653
N  -3.175803 0.68892 0.467205
N  -2.626468 0.974479 1.651651
N  -4.635374 0.028693 1.92892
N  -2.941811 -2.336154 -1.372636
C  -1.515874 -0.150296 -1.192898
C  -0.409546 -0.410131 -0.138837
C  -2.492762 0.969913 -0.768485
C  -0.881108 0.136539 -2.552963
C  0.464895 0.807799 0.151737
C  1.625578 0.416314 1.021347
C  -2.303034 -1.382192 -1.304957
C  -0.88318 1.403123 -3.126741
C  -0.22294 -0.897835 -3.217232
C  2.828599 0.001422 0.457371
C  1.508928 0.410596 2.408326
C  -0.239434 1.629508 -4.337804
C  0.417591 -0.672198 -4.424066
C  -4.374625 0.124738 0.649485
C  0.412899 0.596129 -4.989658
C  3.89297 -0.403733 1.24806
C  2.561738 0.008213 3.21672
C  -3.534812 0.561423 2.496409
C  3.748319 -0.396479 2.62622
H  0.213391 -1.228638 -0.506418
H  -0.861962 -0.764432 0.789307
H  -1.958056 1.908312 -0.640806
H  -3.2439 1.121286 -1.542902
H  -0.122128 1.577489 0.654976
H  0.834721 1.242456 -0.779714
H  -1.375562 2.238322 -2.647987
H  -0.206071 -1.895953 -2.794994
H  2.944596 -0.004539 -0.620068
H  0.581468 0.727278 2.871129
H  -0.251249 2.622721 -4.767195
H  0.921148 -1.490015 -4.922695
H  -5.009989 -0.183769 -0.165981
H  0.914435 0.774759 -5.93171
H  4.821733 -0.718895 0.791863
H  2.455142 0.012982 4.293131
H  -3.402758 0.65157 3.563288
elementType: Cl N C H
totalener: -1413.54261661 hartree
nucrepener: 2024.72310939 hartree
electener: -3438.26572600 hartree
oneelecener: -5948.67944209 hartree
twoeener: 2510.41371609 hartree
cpcmener: -0.03168913 hartree
kineticenergy: 1408.73311727 hartree
xcener: -115.425174011987 hartree
chargesum: -0.0000000
charge: -0.103720 0.135644 -0.370672 -0.410323 -0.068809 0.663659 -0.281675 -0.231968 -0.066880 -0.025199 0.017806 -0.334669 -0.202462 -0.215917 -0.214527 -0.206802 -0.147931 -0.170066 0.063910 -0.143288 -0.151585 -0.159132 0.084993 0.095622 0.130979 0.128669 0.141410 0.165900 0.101801 0.110420 0.136964 0.137379 0.137771 0.140907 0.159851 0.158909 0.184787 0.161710 0.143319 0.142315 0.160900
qa: -0.1037 0.1356 -0.3707 -0.4103 -0.0688 0.6637 -0.2817 -0.2320 -0.0669 -0.0252 0.0178 -0.3347 -0.2025 -0.2159 -0.2145 -0.2068 -0.1479 -0.1701 0.0639 -0.1433 -0.1516 -0.1591 0.0850 0.0956 0.1310 0.1287 0.1414 0.1659 0.1018 0.1104 0.1370 0.1374 0.1378 0.1409 0.1599 0.1589 0.1848 0.1617 0.1433 0.1423 0.1609
va: 1.2017 3.3078 2.8359 3.0394 3.1228 3.4489 3.8979 3.9115 3.5690 3.6417 3.5683 4.0678 3.9023 3.9934 3.9936 3.9867 3.9235 3.9410 4.0522 3.8985 3.9861 4.0057 4.0136 3.8236 1.0099 1.0162 0.9900 0.9922 1.0295 1.0141 1.0153 1.0116 1.0058 1.0110 0.9917 0.9922 0.9905 0.9885 1.0054 1.0063 0.9935
dispcorr: -0.021952248 hartree
energy: -1413.564568854850
dipole: -9.32631 10.00390 0.67760 7.43653 -5.43052 2.00601 -16.96958 14.86423 -2.10535
magnitude: 2.98592 au
magnitude: 7.58961 debye
