program: Orca
programVersion: 4.2.1
elementType: Cl N N N N C C C C C C C C C C C C C C C C C C C H H H H H H H H H H H H H H H H H
charge: 0
multiplicity: 1
keywords: wb97x-d3
keywords: def2-TZVPP
keywords: def2/J RIJCOSX GRIDX6 NOFINALGRIDX
keywords: grid4 nofinalgrid
keywords: scfconv7
keywords: smallprint printgap noloewdin
keywords: NOSOSCF
formula: C19H17ClN4
InChI: InChI=1/C19H17ClN4/c20-18-8-6-16(7-9-18)10-11-19(12-21,13-24-15-22-14-23-24)17-4-2-1-3-5-17/h1-9,14-15H,10-11,13H2
41 atoms
Cl 5.563024 0.119544 3.205968
N  -2.565825 0.703546 0.450334
N  -1.767704 1.150469 1.426312
N  -3.02865 2.815406 0.6208
N  -1.604329 -3.416122 -1.720127
C  -1.395555 -0.896656 -1.05095
C  0.016788 -0.679658 -0.466908
C  -2.51904 -0.660301 0.00117
C  -1.678408 -0.017429 -2.266726
C  0.397773 -1.637249 0.663151
C  1.691602 -1.218689 1.30274
C  -1.509485 -2.30456 -1.441309
C  -1.045169 1.21083 -2.427889
C  -2.656681 -0.391667 -3.186161
C  1.705444 -0.199767 2.253162
C  2.900058 -1.807835 0.947299
C  -1.378371 2.042331 -3.489122
C  -2.986282 0.436822 -4.247585
C  -3.309094 1.709317 -0.021938
C  -2.3480 1.659576 -4.4025
C  2.888138 0.21773 2.842127
C  4.095416 -1.402339 1.52484
C  -2.07973 2.418962 1.492487
C  4.077342 -0.391342 2.471063
H  0.083779 0.342718 -0.09653
H  0.742309 -0.767634 -1.278359
H  -3.484968 -0.904796 -0.437868
H  -2.387989 -1.303847 0.869006
H  0.487588 -2.656835 0.282089
H  -0.380016 -1.654433 1.429156
H  -0.287526 1.543183 -1.731644
H  -3.173648 -1.339123 -3.08637
H  0.775426 0.278431 2.539616
H  2.917958 -2.601131 0.209549
H  -0.875094 2.994423 -3.595684
H  -3.743653 0.123492 -4.954259
H  -4.03245 1.584418 -0.813081
H  -2.604788 2.308003 -5.23001
H  2.878766 1.005483 3.583519
H  5.025552 -1.87462 1.238285
H  -1.608468 3.08367 2.199943
elementType: Cl N C H
totalener: -1413.54265549 hartree
nucrepener: 2041.20923497 hartree
electener: -3454.75189046 hartree
oneelecener: -5981.65181688 hartree
twoeener: 2526.89992642 hartree
cpcmener: -0.02930734 hartree
kineticenergy: 1408.72726042 hartree
xcener: -115.424662690664 hartree
chargesum: -0.0000000
charge: -0.104487 0.167752 -0.379777 -0.397200 -0.074158 0.659676 -0.261977 -0.207363 -0.112433 -0.025095 0.006917 -0.334527 -0.191603 -0.192067 -0.221711 -0.211796 -0.157822 -0.168729 0.050375 -0.139776 -0.160467 -0.144290 0.090668 0.093912 0.096796 0.136069 0.154494 0.154314 0.093856 0.109045 0.148112 0.136370 0.149997 0.139333 0.159386 0.159365 0.174424 0.161636 0.140952 0.143079 0.158750
qa: -0.1045 0.1678 -0.3798 -0.3972 -0.0742 0.6597 -0.2620 -0.2074 -0.1124 -0.0251 0.0069 -0.3345 -0.1916 -0.1921 -0.2217 -0.2118 -0.1578 -0.1687 0.0504 -0.1398 -0.1605 -0.1443 0.0907 0.0939 0.0968 0.1361 0.1545 0.1543 0.0939 0.1090 0.1481 0.1364 0.1500 0.1393 0.1594 0.1594 0.1744 0.1616 0.1410 0.1431 0.1587
va: 1.2008 3.2542 2.8098 3.0324 3.1263 3.5035 3.8972 3.9404 3.5917 3.6970 3.6023 4.1147 3.8921 3.9706 3.9622 4.0051 3.9466 3.9424 4.0709 3.8983 4.0182 3.9725 4.0019 3.8222 1.0219 1.0115 0.9965 0.9991 1.0234 1.0194 1.0021 1.0142 1.0198 1.0055 0.9921 0.9920 0.9925 0.9881 1.0076 1.0053 0.9940
dispcorr: -0.022932540 hartree
energy: -1413.565588031128
dipole: -16.59574 15.46435 -1.13140 0.04166 0.41088 0.45254 -12.68650 11.81482 -0.87168
magnitude: 1.49822 au
magnitude: 3.80819 debye
