program: Orca
programVersion: 4.2.1
elementType: Cl N N N N C C C C C C C C C C C C C C C C C C C H H H H H H H H H H H H H H H H H
charge: 0
multiplicity: 1
keywords: wb97x-d3
keywords: def2-TZVPP
keywords: def2/J RIJCOSX GRIDX6 NOFINALGRIDX
keywords: grid4 nofinalgrid
keywords: scfconv7
keywords: smallprint printgap noloewdin
keywords: NOSOSCF
formula: C19H17ClN4
InChI: InChI=1/C19H17ClN4/c20-18-8-6-16(7-9-18)10-11-19(12-21,13-24-15-22-14-23-24)17-4-2-1-3-5-17/h1-9,14-15H,10-11,13H2
41 atoms
Cl 6.295004 -1.861121 2.650393
N  -3.691407 0.895582 0.368777
N  -4.582106 -0.099561 0.385721
N  -5.383419 1.649175 -0.758621
N  -2.15035 -2.333042 -0.575871
C  -1.365819 0.098105 -0.019899
C  -0.022887 -0.047587 0.730191
C  -2.388048 0.736398 0.952745
C  -1.261905 0.952643 -1.276171
C  1.09345 -0.614154 -0.134776
C  2.37284 -0.915494 0.602281
C  -1.824947 -1.254487 -0.347811
C  -1.841112 0.572624 -2.480778
C  -0.633525 2.194604 -1.196262
C  2.696175 -0.344923 1.829281
C  3.295815 -1.7879 0.025999
C  -1.788086 1.412309 -3.586378
C  -0.580801 3.031768 -2.298833
C  -4.180024 1.929602 -0.324145
C  -1.158919 2.643329 -3.500114
C  3.897833 -0.629853 2.464634
C  4.500201 -2.082429 0.642072
C  -5.579289 0.397158 -0.298203
C  4.792827 -1.497264 1.86452
H  -0.188498 -0.686538 1.601011
H  0.251088 0.935525 1.117333
H  -2.485948 0.13101 1.852862
H  -2.017959 1.71681 1.250027
H  1.315528 0.083999 -0.947021
H  0.754784 -1.533507 -0.620382
H  -2.344664 -0.381029 -2.577025
H  -0.176886 2.525434 -0.271505
H  2.014572 0.337186 2.320219
H  3.07158 -2.252115 -0.926972
H  -2.245224 1.09759 -4.515282
H  -0.086013 3.990705 -2.217634
H  -3.636159 2.84908 -0.473934
H  -1.117563 3.297312 -4.361192
H  4.124814 -0.175913 3.419721
H  5.197838 -2.763489 0.173864
H  -6.485654 -0.162208 -0.468561
elementType: Cl N C H
totalener: -1413.54295583 hartree
nucrepener: 2008.39594000 hartree
electener: -3421.93889583 hartree
oneelecener: -5916.02158094 hartree
twoeener: 2494.08268511 hartree
cpcmener: -0.03689775 hartree
kineticenergy: 1408.74137884 hartree
xcener: -115.428169175345 hartree
chargesum: 0.0000000
charge: -0.104319 0.122174 -0.341580 -0.401149 -0.051468 0.731221 -0.252414 -0.147933 -0.245275 -0.015165 0.033997 -0.384962 -0.110314 -0.232675 -0.217843 -0.212690 -0.155836 -0.150999 0.052142 -0.140072 -0.167566 -0.161396 0.071010 0.104336 0.131285 0.104481 0.142037 0.144963 0.104760 0.096165 0.136752 0.139903 0.137448 0.137659 0.161063 0.160971 0.172788 0.161240 0.142213 0.142676 0.162367
qa: -0.1043 0.1222 -0.3416 -0.4011 -0.0515 0.7312 -0.2524 -0.1479 -0.2453 -0.0152 0.0340 -0.3850 -0.1103 -0.2327 -0.2178 -0.2127 -0.1558 -0.1510 0.0521 -0.1401 -0.1676 -0.1614 0.0710 0.1043 0.1313 0.1045 0.1420 0.1450 0.1048 0.0962 0.1368 0.1399 0.1374 0.1377 0.1611 0.1610 0.1728 0.1612 0.1422 0.1427 0.1624
va: 1.2009 3.3584 2.8875 3.0287 3.1191 3.4804 3.9395 3.8835 3.6458 3.7293 3.6423 4.1348 3.8301 3.9581 3.9708 4.0197 3.9422 3.9300 4.0716 3.8957 4.0272 3.9939 4.0353 3.8151 1.0059 1.0008 1.0143 0.9935 1.0025 1.0125 1.0175 1.0111 1.0079 1.0048 0.9913 0.9905 0.9939 0.9885 1.0074 1.0059 0.9943
dispcorr: -0.021978662 hartree
energy: -1413.564934496082
dipole: -12.25149 13.45865 1.20716 10.85345 -8.35704 2.49641 -9.02378 9.23921 0.21543
magnitude: 2.78131 au
magnitude: 7.06954 debye
