program: Orca
programVersion: 4.2.1
elementType: Cl N N N N C C C C C C C C C C C C C C C C C C C H H H H H H H H H H H H H H H H H
charge: 0
multiplicity: 1
keywords: wb97x-d3
keywords: def2-TZVPP
keywords: def2/J RIJCOSX GRIDX6 NOFINALGRIDX
keywords: grid4 nofinalgrid
keywords: scfconv7
keywords: smallprint printgap noloewdin
keywords: NOSOSCF
formula: C19H17ClN4
InChI: InChI=1/C19H17ClN4/c20-18-8-6-16(7-9-18)10-11-19(12-21,13-24-15-22-14-23-24)17-4-2-1-3-5-17/h1-9,14-15H,10-11,13H2
41 atoms
Cl 4.741568 1.17063 0.26418
N  -3.322557 0.572776 0.093994
N  -3.533248 0.787054 1.395945
N  -3.610393 2.715507 0.262584
N  -1.479361 -3.511074 -1.452682
C  -1.589868 -1.20485 -0.22612
C  -1.313074 -1.498924 1.268567
C  -3.063806 -0.737989 -0.431237
C  -0.649088 -0.195266 -0.878378
C  -0.018262 -2.253298 1.591555
C  1.234215 -1.475835 1.304026
C  -1.51158 -2.488311 -0.927902
C  -0.257114 -0.333741 -2.206635
C  -0.217625 0.922876 -0.17064
C  1.660615 -0.48075 2.178884
C  1.951992 -1.673149 0.1294
C  0.577673 0.600837 -2.802208
C  0.621157 1.853458 -0.762894
C  -3.366717 1.733244 -0.568267
C  1.028895 1.693588 -2.078924
C  2.744792 0.327872 1.876461
C  3.035392 -0.872033 -0.194977
C  -3.698489 2.083376 1.450235
C  3.413548 0.133985 0.678744
H  -2.14907 -2.095233 1.6404
H  -1.346951 -0.564794 1.827793
H  -3.289003 -0.71415 -1.496138
H  -3.746986 -1.444225 0.039382
H  0.000282 -3.209514 1.062905
H  -0.059856 -2.499829 2.654855
H  -0.586368 -1.182761 -2.793852
H  -0.50875 1.074785 0.85995
H  1.128388 -0.316076 3.108783
H  1.653502 -2.453095 -0.561588
H  0.87911 0.465893 -3.833085
H  0.96368 2.702963 -0.186277
H  -3.227074 1.805766 -1.635563
H  1.692463 2.4158 -2.536775
H  3.054911 1.105258 2.562271
H  3.568449 -1.025858 -1.123612
H  -3.90068 2.593187 2.37954
elementType: Cl N C H
totalener: -1413.53884343 hartree
nucrepener: 2179.89557138 hartree
electener: -3593.43441481 hartree
oneelecener: -6259.29459117 hartree
twoeener: 2665.86017636 hartree
cpcmener: -0.02913221 hartree
kineticenergy: 1408.74299596 hartree
xcener: -115.432418760136 hartree
chargesum: 0.0000000
charge: -0.110606 0.135417 -0.362920 -0.397574 -0.066945 0.671650 -0.199686 -0.148939 -0.127654 -0.123944 0.122307 -0.387346 -0.161862 -0.212161 -0.262952 -0.199183 -0.162977 -0.151392 0.058711 -0.147210 -0.121253 -0.144530 0.074599 0.095737 0.112767 0.101458 0.148382 0.145674 0.103159 0.107459 0.132587 0.139568 0.137773 0.135163 0.157459 0.147705 0.173026 0.153638 0.139004 0.133737 0.162154
qa: -0.1106 0.1354 -0.3629 -0.3976 -0.0669 0.6717 -0.1997 -0.1489 -0.1277 -0.1239 0.1223 -0.3873 -0.1619 -0.2122 -0.2630 -0.1992 -0.1630 -0.1514 0.0587 -0.1472 -0.1213 -0.1445 0.0746 0.0957 0.1128 0.1015 0.1484 0.1457 0.1032 0.1075 0.1326 0.1396 0.1378 0.1352 0.1575 0.1477 0.1730 0.1536 0.1390 0.1337 0.1622
va: 1.1936 3.3285 2.8600 3.0306 3.1116 3.4393 3.8493 3.8844 3.5770 3.8645 3.4721 4.1309 3.9050 3.8941 3.9782 3.9468 3.9165 3.9045 4.0671 3.8894 3.9454 3.9277 4.0289 3.7744 1.0167 1.0231 0.9973 1.0072 1.0138 1.0050 1.0159 1.0060 1.0042 1.0055 0.9917 0.9965 0.9938 0.9911 1.0051 1.0094 0.9946
dispcorr: -0.028028174 hartree
energy: -1413.566871607374
dipole: -12.02148 11.52512 -0.49635 -4.68671 4.80472 0.11800 1.22078 -1.08739 0.13339
magnitude: 0.52734 au
magnitude: 1.34039 debye
