program: Orca
programVersion: 4.2.1
elementType: Cl N N N N C C C C C C C C C C C C C C C C C C C H H H H H H H H H H H H H H H H H
charge: 0
multiplicity: 1
keywords: wb97x-d3
keywords: def2-TZVPP
keywords: def2/J RIJCOSX GRIDX6 NOFINALGRIDX
keywords: grid4 nofinalgrid
keywords: scfconv7
keywords: smallprint printgap noloewdin
keywords: NOSOSCF
formula: C19H17ClN4
InChI: InChI=1/C19H17ClN4/c20-18-8-6-16(7-9-18)10-11-19(12-21,13-24-15-22-14-23-24)17-4-2-1-3-5-17/h1-9,14-15H,10-11,13H2
41 atoms
Cl 5.479761 -0.389494 3.595889
N  -3.258332 0.580869 0.236977
N  -2.800494 1.033628 1.410315
N  -3.886565 2.659725 0.313382
N  -1.556986 -3.378616 -1.730232
C  -1.570425 -0.917774 -0.844109
C  -0.472278 -0.816036 0.234524
C  -2.986832 -0.752662 -0.213067
C  -1.416116 0.083862 -1.98143
C  0.930613 -1.047638 -0.304624
C  2.03551 -0.871583 0.706584
C  -1.550301 -2.28896 -1.363269
C  -1.783383 -0.24374 -3.282956
C  -0.996596 1.384904 -1.71448
C  3.358395 -0.948338 0.273242
C  1.80916 -0.640637 2.057995
C  -1.731196 0.704571 -4.293955
C  -0.944023 2.332072 -2.724866
C  -3.897739 1.570247 -0.407201
C  -1.312075 1.996248 -4.018577
C  4.419159 -0.803222 1.148003
C  2.861852 -0.49195 2.951417
C  -3.200939 2.281647 1.412415
C  4.162856 -0.57438 2.491817
H  -0.702052 -1.551098 1.010494
H  -0.543153 0.156135 0.72145
H  -3.739552 -1.01436 -0.9569
H  -3.09852 -1.434083 0.630351
H  1.11656 -0.369733 -1.141969
H  0.997903 -2.057259 -0.721791
H  -2.10698 -1.24915 -3.522957
H  -0.70847 1.678511 -0.71335
H  3.565075 -1.125818 -0.775697
H  0.801156 -0.569841 2.445181
H  -2.017068 0.427448 -5.29994
H  -0.617849 3.337308 -2.494511
H  -4.342898 1.447146 -1.382832
H  -1.27104 2.736208 -4.806583
H  5.437587 -0.865617 0.790254
H  2.664751 -0.312744 3.999354
H  -2.999472 2.941376 2.24173
totalener: -1413.51239662 hartree
nucrepener: 2033.70141703 hartree
electener: -3447.21381366 hartree
oneelecener: -5966.62500142 hartree
twoeener: 2519.41118776 hartree
kineticenergy: 1408.73854699 hartree
xcener: -115.426221402095 hartree
chargesum: -0.0000000
charge: -0.084106 0.135231 -0.338807 -0.318351 0.025033 0.627072 -0.224445 -0.178012 -0.124542 -0.103631 0.073824 -0.394074 -0.178852 -0.244907 -0.194043 -0.171609 -0.119984 -0.079056 0.037611 -0.131042 -0.143606 -0.163491 0.072375 0.107763 0.107493 0.099107 0.141225 0.137827 0.103536 0.106916 0.129058 0.131126 0.115772 0.118112 0.133571 0.133731 0.147453 0.132508 0.120251 0.119695 0.136267
qa: -0.0841 0.1352 -0.3388 -0.3184 0.0250 0.6271 -0.2244 -0.1780 -0.1245 -0.1036 0.0738 -0.3941 -0.1789 -0.2449 -0.1940 -0.1716 -0.1200 -0.0791 0.0376 -0.1310 -0.1436 -0.1635 0.0724 0.1078 0.1075 0.0991 0.1412 0.1378 0.1035 0.1069 0.1291 0.1311 0.1158 0.1181 0.1336 0.1337 0.1475 0.1325 0.1203 0.1197 0.1363
va: 1.2224 3.2808 2.8273 3.0575 3.1287 3.5699 3.8908 3.9152 3.6734 3.8250 3.6909 4.0751 3.9973 3.9601 4.0490 3.9790 3.9751 3.9717 4.0842 3.9726 4.0279 4.0811 4.0276 3.9074 1.0093 1.0200 0.9996 1.0111 1.0004 1.0041 1.0212 1.0093 1.0092 1.0132 1.0006 0.9996 0.9996 0.9987 1.0128 1.0147 1.0002
dispcorr: -0.022455023 hartree
energy: -1413.534851646638
dipole: -14.43211 13.90956 -0.52255 2.55004 -1.96164 0.58840 -14.27619 13.41963 -0.85656
magnitude: 1.16317 au
magnitude: 2.95655 debye
