program: Orca
programVersion: 4.2.1
elementType: Cl N N N N C C C C C C C C C C C C C C C C C C C H H H H H H H H H H H H H H H H H
charge: 0
multiplicity: 1
keywords: wb97x-d3
keywords: def2-TZVPP
keywords: def2/J RIJCOSX GRIDX6 NOFINALGRIDX
keywords: grid4 nofinalgrid
keywords: scfconv7
keywords: smallprint printgap noloewdin
keywords: NOSOSCF
formula: C19H17ClN4
InChI: InChI=1/C19H17ClN4/c20-18-8-6-16(7-9-18)10-11-19(12-21,13-24-15-22-14-23-24)17-4-2-1-3-5-17/h1-9,14-15H,10-11,13H2
41 atoms
Cl 4.889938 -0.574161 3.877908
N  -2.972337 0.807041 0.500844
N  -2.316455 1.271966 1.572467
N  -4.249673 0.322704 2.19038
N  -3.063846 -2.36221 -1.155501
C  -1.527883 -0.244905 -1.242393
C  -0.356229 -0.476245 -0.256067
C  -2.422082 0.943665 -0.819907
C  -0.991939 -0.073544 -2.66182
C  0.626414 0.689515 -0.17138
C  1.706699 0.394589 0.830159
C  -2.380811 -1.438295 -1.205903
C  -0.925032 1.162721 -3.293896
C  -0.490991 -1.188582 -3.33088
C  1.478083 0.597083 2.188075
C  2.936514 -0.118623 0.436303
C  -0.370678 1.281638 -4.56177
C  0.063849 -1.070824 -4.593227
C  -4.12529 0.240083 0.892245
C  0.127368 0.167971 -5.215046
C  2.449308 0.301349 3.129929
C  3.9204 -0.42036 1.365501
C  -3.119045 0.957818 2.559577
C  3.668915 -0.207113 2.710453
H  0.177962 -1.375908 -0.570218
H  -0.756278 -0.692169 0.736113
H  -1.851279 1.869209 -0.827067
H  -3.241438 1.053227 -1.53162
H  0.105382 1.599385 0.13205
H  1.066539 0.881821 -1.152047
H  -1.298464 2.058178 -2.816532
H  -0.54096 -2.166292 -2.866626
H  0.523162 0.995549 2.511162
H  3.137336 -0.283022 -0.615824
H  -0.330675 2.253403 -5.035508
H  0.44358 -1.951449 -5.093815
H  -4.82473 -0.212734 0.206382
H  0.558404 0.261576 -6.202705
H  2.262297 0.467184 4.181885
H  4.875053 -0.814639 1.045711
H  -2.883485 1.200955 3.583768
totalener: -1413.51245961 hartree
nucrepener: 2027.69102823 hartree
electener: -3441.20348784 hartree
oneelecener: -5954.64311358 hartree
twoeener: 2513.43962573 hartree
kineticenergy: 1408.73779544 hartree
xcener: -115.423488048760 hartree
chargesum: 0.0000000
charge: -0.083789 0.129646 -0.348604 -0.327785 0.020151 0.660344 -0.281363 -0.287219 -0.079798 -0.038193 0.010987 -0.391340 -0.182392 -0.183955 -0.182755 -0.187661 -0.120136 -0.140198 0.061345 -0.110445 -0.141249 -0.128951 0.085027 0.092987 0.121175 0.132959 0.129907 0.158978 0.101523 0.099703 0.114771 0.125260 0.131223 0.113681 0.131754 0.133491 0.155489 0.133642 0.119831 0.119710 0.132248
qa: -0.0838 0.1296 -0.3486 -0.3278 0.0202 0.6603 -0.2814 -0.2872 -0.0798 -0.0382 0.0110 -0.3913 -0.1824 -0.1840 -0.1828 -0.1877 -0.1201 -0.1402 0.0613 -0.1104 -0.1412 -0.1290 0.0850 0.0930 0.1212 0.1330 0.1299 0.1590 0.1015 0.0997 0.1148 0.1253 0.1312 0.1137 0.1318 0.1335 0.1555 0.1336 0.1198 0.1197 0.1322
va: 1.2229 3.2762 2.8116 3.0761 3.1186 3.4092 3.9029 3.9608 3.6089 3.6632 3.6637 4.0268 3.9387 4.0415 3.9953 4.0234 4.0011 3.9986 4.0682 3.9564 4.0418 4.0136 4.0259 3.9159 1.0148 1.0140 0.9988 0.9936 1.0225 1.0156 1.0197 1.0143 1.0169 1.0111 1.0010 1.0005 0.9998 0.9983 1.0140 1.0130 1.0005
dispcorr: -0.022139537 hartree
energy: -1413.534599148520
dipole: -8.94054 9.46852 0.52798 5.45053 -4.26604 1.18449 -18.94626 17.09743 -1.84883
magnitude: 2.25831 au
magnitude: 5.74016 debye
