program: Orca
programVersion: 4.2.1
elementType: Cl N N N N C C C C C C C C C C C C C C C C C C C H H H H H H H H H H H H H H H H H
charge: 0
multiplicity: 1
keywords: wb97x-d3
keywords: def2-TZVPP
keywords: def2/J RIJCOSX GRIDX6 NOFINALGRIDX
keywords: grid4 nofinalgrid
keywords: scfconv7
keywords: smallprint printgap noloewdin
keywords: NOSOSCF
formula: C19H17ClN4
InChI: InChI=1/C19H17ClN4/c20-18-8-6-16(7-9-18)10-11-19(12-21,13-24-15-22-14-23-24)17-4-2-1-3-5-17/h1-9,14-15H,10-11,13H2
41 atoms
Cl 3.942428 -3.467861 1.122454
N  -3.448163 0.341197 0.276448
N  -3.91282 1.179129 1.212152
N  -4.673954 -0.898188 1.573606
N  -0.67495 -1.889048 -0.229846
C  -1.0535 0.690628 -0.405306
C  -0.75067 1.385527 0.942947
C  -2.564389 0.809352 -0.754442
C  -0.280395 1.30169 -1.567022
C  0.730441 1.616117 1.247336
C  1.561844 0.363961 1.236649
C  -0.780501 -0.745633 -0.294073
C  0.461716 0.532103 -2.454547
C  -0.340564 2.679628 -1.766822
C  1.391861 -0.612577 2.213733
C  2.49921 0.136276 0.236097
C  1.13463 1.127025 -3.513033
C  0.332065 3.273931 -2.821735
C  -3.912355 -0.89787 0.511504
C  1.074553 2.497915 -3.700091
C  2.115416 -1.791056 2.185829
C  3.2357 -1.037476 0.193249
C  -4.641501 0.392923 1.964937
C  3.034028 -1.998599 1.168273
H  -1.204886 0.799561 1.74376
H  -1.269637 2.346339 0.95802
H  -2.805777 1.855015 -0.936806
H  -2.762795 0.257856 -1.673914
H  0.787443 2.090378 2.230833
H  1.146344 2.337108 0.541321
H  0.533637 -0.53936 -2.320007
H  -0.909456 3.306711 -1.090504
H  0.671759 -0.46119 3.00962
H  2.658006 0.884778 -0.530542
H  1.710079 0.510295 -4.19056
H  0.276519 4.346029 -2.955834
H  -3.666187 -1.748944 -0.104654
H  1.601958 2.96054 -4.523553
H  1.965164 -2.545715 2.945169
H  3.960029 -1.201407 -0.592704
H  -5.174806 0.764739 2.825765
totalener: -1413.51080294 hartree
nucrepener: 2106.62013651 hartree
electener: -3520.13093945 hartree
oneelecener: -6113.02144780 hartree
twoeener: 2592.89050834 hartree
kineticenergy: 1408.74865202 hartree
xcener: -115.428102108341 hartree
chargesum: 0.0000000
charge: -0.083589 0.100706 -0.319849 -0.329158 0.019755 0.795578 -0.248463 -0.168882 -0.104117 -0.131834 0.046740 -0.502425 -0.213915 -0.287822 -0.169823 -0.152757 -0.099153 -0.118832 0.059664 -0.127117 -0.116044 -0.138407 0.065991 0.109246 0.112809 0.107831 0.131554 0.142409 0.108303 0.098286 0.135017 0.128471 0.106469 0.119947 0.134317 0.132536 0.152451 0.133144 0.117919 0.117732 0.135312
qa: -0.0836 0.1007 -0.3198 -0.3292 0.0198 0.7956 -0.2485 -0.1689 -0.1041 -0.1318 0.0467 -0.5024 -0.2139 -0.2878 -0.1698 -0.1528 -0.0992 -0.1188 0.0597 -0.1271 -0.1160 -0.1384 0.0660 0.1092 0.1128 0.1078 0.1316 0.1424 0.1083 0.0983 0.1350 0.1285 0.1065 0.1199 0.1343 0.1325 0.1525 0.1331 0.1179 0.1177 0.1353
va: 1.2226 3.3207 2.8497 3.0673 3.1119 3.2218 3.8717 3.8958 3.5993 3.8915 3.5801 4.0584 3.9642 4.0423 4.0055 3.9454 3.9371 4.0017 4.0648 3.9759 4.0315 4.0407 4.0428 3.9261 1.0074 1.0188 1.0138 1.0016 1.0029 1.0094 1.0235 1.0119 1.0135 0.9957 1.0004 1.0003 1.0040 0.9984 1.0119 1.0131 1.0000
dispcorr: -0.024737906 hartree
energy: -1413.535540849030
dipole: -7.61457 7.91176 0.29720 19.96258 -17.95841 2.00417 -6.30966 5.22482 -1.08484
magnitude: 2.29824 au
magnitude: 5.84165 debye
