program: Orca
programVersion: 4.2.1
elementType: Cl Cl O N N C C C C C C C C C C C C C C C C C H H H H H H H H H H H H
charge: 0
multiplicity: 1
keywords: wb97x-d3
keywords: def2-TZVPP
keywords: def2/J RIJCOSX GRIDX6 NOFINALGRIDX
keywords: grid4 nofinalgrid
keywords: scfconv7
keywords: smallprint printgap noloewdin
keywords: NOSOSCF
formula: C17H12Cl2N2O
InChI: InChI=1/C17H12Cl2N2O/c18-14-7-5-12(6-8-14)17(22,13-9-20-11-21-10-13)15-3-1-2-4-16(15)19/h1-11,22H
34 atoms
Cl 3.333504 0.624062 1.274662
Cl -5.348387 -0.663313 -1.259861
O  0.320115 0.545299 2.081515
N  1.382766 -3.288227 1.348846
N  2.165849 -2.665959 -0.791553
C  0.296621 0.261283 0.704875
C  -1.13987 0.074071 0.201489
C  1.045136 1.374169 -0.03425
C  0.958299 -1.096031 0.528408
C  -1.387482 -0.273267 -1.126228
C  -2.218825 0.17748 1.067596
C  2.407028 1.608291 0.187679
C  0.384335 2.267043 -0.874026
C  0.854737 -2.079799 1.500616
C  1.639076 -1.460434 -0.621897
C  -2.67326 -0.493741 -1.584565
C  -3.517429 -0.045801 0.624715
C  3.081961 2.643337 -0.440017
C  1.043813 3.314993 -1.498915
C  -3.734759 -0.378826 -0.698416
C  2.399585 3.498037 -1.291191
C  2.013289 -3.518856 0.208308
H  -0.575847 -0.371639 -1.835761
H  -2.078273 0.424092 2.110121
H  -0.675794 2.155455 -1.049344
H  -0.018398 1.438719 2.220294
H  0.333289 -1.902144 2.432304
H  1.77935 -0.760023 -1.438093
H  -2.839562 -0.754803 -2.620152
H  -4.342909 0.038628 1.317692
H  4.137669 2.787431 -0.257087
H  0.490796 3.983148 -2.144236
H  2.931035 4.304833 -1.776984
H  2.444486 -4.503781 0.079948
elementType: Cl O N C H
totalener: -1760.23682043 hartree
nucrepener: 2004.22281391 hartree
electener: -3764.45963434 hartree
oneelecener: -6395.43885544 hartree
twoeener: 2630.97922110 hartree
cpcmener: -0.02935763 hartree
kineticenergy: 1755.35490148 hartree
xcener: -124.324880067404 hartree
chargesum: 0.0000000
charge: -0.080343 -0.098224 -0.376552 -0.358611 -0.353281 0.886204 -0.104160 -0.182378 -0.142012 -0.273512 -0.185094 -0.062214 -0.048393 -0.018730 0.042018 -0.157306 -0.164187 -0.156740 -0.187012 0.113412 -0.131258 0.178087 0.156733 0.137001 0.162001 0.226400 0.133941 0.144698 0.146552 0.144106 0.138658 0.162139 0.165531 0.142526
qa: -0.0803 -0.0982 -0.3766 -0.3586 -0.3533 0.8862 -0.1042 -0.1824 -0.1420 -0.2735 -0.1851 -0.0622 -0.0484 -0.0187 0.0420 -0.1573 -0.1642 -0.1567 -0.1870 0.1134 -0.1313 0.1781 0.1567 0.1370 0.1620 0.2264 0.1339 0.1447 0.1466 0.1441 0.1387 0.1621 0.1655 0.1425
va: 1.2398 1.2072 2.0537 3.0328 3.0517 3.1457 3.4908 3.5782 3.6089 4.0428 4.0194 3.9806 3.7548 4.1524 4.0491 4.0602 4.0189 4.0112 3.9612 3.8200 3.9018 4.0074 0.9983 1.0326 0.9935 1.0065 1.0310 1.0040 1.0064 1.0082 1.0109 0.9915 0.9860 0.9948
dispcorr: -0.019799276 hartree
energy: -1760.256619702851
dipole: 4.15324 -4.60022 -0.44698 6.40982 -3.84124 2.56858 -2.78665 2.20544 -0.58122
magnitude: 2.67118 au
magnitude: 6.78961 debye
