program: Orca
programVersion: 4.2.1
elementType: Cl Cl O N N C C C C C C C C C C C C C C C C C H H H H H H H H H H H H
charge: 0
multiplicity: 1
keywords: wb97x-d3
keywords: def2-TZVPP
keywords: def2/J RIJCOSX GRIDX6 NOFINALGRIDX
keywords: grid4 nofinalgrid
keywords: scfconv7
keywords: smallprint printgap noloewdin
keywords: NOSOSCF
formula: C17H12Cl2N2O
InChI: InChI=1/C17H12Cl2N2O/c18-14-7-5-12(6-8-14)17(22,13-9-20-11-21-10-13)15-3-1-2-4-16(15)19/h1-11,22H
34 atoms
Cl 0.746332 0.601315 -2.122997
Cl -5.247044 0.439655 -0.102094
O  0.842952 -0.395163 2.297724
N  1.395922 -3.840937 -0.020942
N  3.175149 -2.521846 -0.839787
C  0.673719 -0.26096 0.90081
C  -0.823057 -0.134986 0.595448
C  1.3465 1.055712 0.508436
C  1.341365 -1.4718 0.260814
C  -1.556193 0.774603 1.35688
C  -1.488352 -0.860347 -0.384009
C  1.38633 1.529985 -0.804524
C  1.91443 1.868121 1.487965
C  0.807467 -2.743126 0.433478
C  2.569711 -1.433169 -0.380835
C  -2.911724 0.959097 1.14921
C  -2.849534 -0.693959 -0.600473
C  1.953212 2.753522 -1.126767
C  2.482875 3.094643 1.179382
C  -3.550866 0.217125 0.167689
C  2.500984 3.543308 -0.130043
C  2.549485 -3.670631 -0.647364
H  -1.072861 1.363975 2.124871
H  -0.963905 -1.566139 -1.012338
H  1.913333 1.548146 2.518293
H  0.290449 -1.122004 2.610314
H  -0.12931 -2.893162 0.959509
H  3.102612 -0.50114 -0.525304
H  -3.458979 1.673228 1.74868
H  -3.345992 -1.272682 -1.366697
H  1.96569 3.085627 -2.15567
H  2.909703 3.69545 1.970644
H  2.938952 4.498962 -0.383139
H  3.032428 -4.560901 -1.030502
elementType: Cl O N C H
totalener: -1760.23584443 hartree
nucrepener: 2020.28682484 hartree
electener: -3780.52266928 hartree
oneelecener: -6427.60953054 hartree
twoeener: 2647.08686126 hartree
cpcmener: -0.02702808 hartree
kineticenergy: 1755.35502355 hartree
xcener: -124.324760136119 hartree
chargesum: -0.0000000
charge: -0.083837 -0.097864 -0.381330 -0.358356 -0.357974 0.752268 -0.043814 0.032191 -0.184778 -0.238057 -0.199075 -0.075750 -0.185528 -0.011304 0.036718 -0.172811 -0.152483 -0.129293 -0.159736 0.105227 -0.159145 0.185928 0.147257 0.161215 0.150858 0.222461 0.144546 0.146741 0.147194 0.145720 0.141191 0.163550 0.165365 0.142706
qa: -0.0838 -0.0979 -0.3813 -0.3584 -0.3580 0.7523 -0.0438 0.0322 -0.1848 -0.2381 -0.1991 -0.0758 -0.1855 -0.0113 0.0367 -0.1728 -0.1525 -0.1293 -0.1597 0.1052 -0.1591 0.1859 0.1473 0.1612 0.1509 0.2225 0.1445 0.1467 0.1472 0.1457 0.1412 0.1635 0.1654 0.1427
va: 1.2418 1.2076 2.0222 3.0403 3.0414 3.3377 3.5689 3.3371 3.7451 4.1012 3.9478 3.9369 3.9337 4.1061 4.0601 4.0169 4.0615 3.9838 3.9226 3.8280 3.9336 4.0066 1.0149 0.9996 1.0337 1.0138 1.0092 1.0077 1.0056 1.0056 1.0075 0.9904 0.9867 0.9945
dispcorr: -0.020068188 hartree
energy: -1760.255912620794
dipole: 12.77988 -12.72443 0.05545 2.27189 -1.21791 1.05398 8.16402 -7.32528 0.83874
magnitude: 1.34812 au
magnitude: 3.42665 debye
