program: Orca
programVersion: 4.2.1
elementType: Cl Cl O N N C C C C C C C C C C C C C C C C C H H H H H H H H H H H H
charge: 0
multiplicity: 1
keywords: wb97x-d3
keywords: def2-TZVPP
keywords: def2/J RIJCOSX GRIDX6 NOFINALGRIDX
keywords: grid4 nofinalgrid
keywords: scfconv7
keywords: smallprint printgap noloewdin
keywords: NOSOSCF
formula: C17H12Cl2N2O
InChI: InChI=1/C17H12Cl2N2O/c18-14-7-5-12(6-8-14)17(22,13-9-20-11-21-10-13)15-3-1-2-4-16(15)19/h1-11,22H
34 atoms
Cl -0.068115 2.773003 1.344108
Cl -5.101038 -0.395108 -0.817005
O  0.908345 -0.07263 2.061998
N  1.452256 -3.451192 -1.067653
N  2.988649 -3.186039 0.706343
C  0.743965 -0.159018 0.667431
C  -0.734689 -0.161373 0.283703
C  1.491017 0.988052 -0.031683
C  1.35087 -1.504732 0.300699
C  -1.646726 -0.791031 1.12452
C  -1.196371 0.385103 -0.90693
C  1.196902 2.327771 0.235431
C  2.502757 0.74952 -0.957403
C  0.89518 -2.291779 -0.747665
C  2.428625 -2.025641 1.011539
C  -2.988678 -0.864757 0.793522
C  -2.537225 0.315402 -1.25302
C  1.873821 3.369121 -0.376379
C  3.189666 1.779454 -1.58211
C  -3.428602 -0.30792 -0.397172
C  2.877972 3.094402 -1.289709
C  2.472589 -3.839058 -0.322422
H  -1.308241 -1.235412 2.051025
H  -0.511831 0.879272 -1.584508
H  2.767475 -0.268146 -1.204729
H  0.507834 0.744913 2.376367
H  0.05037 -1.983326 -1.354197
H  2.853666 -1.49022 1.851422
H  -3.688404 -1.355089 1.456065
H  -2.883906 0.747951 -2.181209
H  1.613693 4.390582 -0.135621
H  3.968876 1.545857 -2.294679
H  3.407531 3.908047 -1.766263
H  2.931789 -4.787585 -0.577702
totalener: -1760.22339982 hartree
nucrepener: 2006.18030751 hartree
electener: -3766.40370734 hartree
oneelecener: -6398.87269285 hartree
twoeener: 2632.46898552 hartree
kineticenergy: 1755.37705306 hartree
xcener: -124.326698696254 hartree
chargesum: 0.0000000
charge: -0.078361 -0.075368 -0.353634 -0.282442 -0.282797 0.930127 -0.206869 -0.121087 -0.296928 -0.178421 -0.148598 -0.111691 -0.066542 0.025789 0.007394 -0.142648 -0.124944 -0.122668 -0.131074 0.110363 -0.108438 0.145756 0.133257 0.135573 0.146309 0.190666 0.124107 0.124562 0.123991 0.122988 0.122136 0.131508 0.133001 0.124981
qa: -0.0784 -0.0754 -0.3536 -0.2824 -0.2828 0.9301 -0.2069 -0.1211 -0.2969 -0.1784 -0.1486 -0.1117 -0.0665 0.0258 0.0074 -0.1426 -0.1249 -0.1227 -0.1311 0.1104 -0.1084 0.1458 0.1333 0.1356 0.1463 0.1907 0.1241 0.1246 0.1240 0.1230 0.1221 0.1315 0.1330 0.1250
va: 1.2591 1.2316 2.0512 3.0725 3.0567 3.0276 3.7161 3.7056 3.8129 4.0699 3.8948 4.0437 3.8186 4.0596 4.1223 4.0333 4.0618 4.0402 4.0107 3.9178 3.9568 4.0401 1.0304 1.0034 0.9979 1.0778 1.0152 1.0356 1.0132 1.0131 1.0127 1.0022 0.9981 0.9944
dispcorr: -0.019849239 hartree
energy: -1760.243249061421
dipole: 15.94834 -15.54079 0.40755 -2.30546 3.65200 1.34654 -3.88218 3.54967 -0.33251
magnitude: 1.44562 au
magnitude: 3.67448 debye
