program: Orca
programVersion: 4.2.1
elementType: Cl Cl O O N N N C C C C C C C C C C C C C C H H H H H H H H H H H H H H H
charge: 0
multiplicity: 1
keywords: wb97x-d3
keywords: def2-TZVPP
keywords: def2/J RIJCOSX GRIDX6 NOFINALGRIDX
keywords: grid4 nofinalgrid
keywords: scfconv7
keywords: smallprint printgap noloewdin
keywords: NOSOSCF
formula: C14H15Cl2N3O2
InChI: InChI=1/C14H15Cl2N3O2/c1-2-11-6-20-14(21-11,7-19-9-17-8-18-19)12-4-3-10(15)5-13(12)16/h3-5,8-9,11H,2,6-7H2,1H3
36 atoms
Cl 1.245112 -0.800544 2.409735
Cl 4.21022 -3.460635 -1.123196
O  -1.101363 0.538263 -1.213524
O  -1.235698 -0.101098 0.92113
N  -0.825656 2.701861 0.568895
N  -1.180895 3.553754 -0.396807
N  -2.521723 3.786213 1.387895
C  -0.348809 0.368299 -0.046301
C  -2.343454 -0.160945 -1.09635
C  -2.179355 -0.900029 0.228891
C  0.214552 1.726355 0.38066
C  0.797849 -0.615046 -0.286473
C  -3.503369 0.819258 -1.126248
C  -4.844921 0.11048 -1.233443
C  1.553753 -1.170066 0.745627
C  1.145073 -0.968079 -1.586923
C  2.600703 -2.045222 0.498508
C  2.184865 -1.839563 -1.863727
C  -1.640038 2.843463 1.615668
C  2.905372 -2.373052 -0.810618
C  -2.194337 4.17842 0.141582
H  -2.429299 -0.863967 -1.930212
H  -3.091717 -0.950816 0.822347
H  -1.804617 -1.918727 0.084241
H  0.895462 2.097653 -0.382588
H  0.782154 1.633479 1.304536
H  -3.377207 1.489169 -1.979609
H  -3.481961 1.44398 -0.228446
H  -4.908571 -0.487198 -2.14438
H  -5.026747 -0.556368 -0.388607
H  -5.661884 0.831194 -1.255967
H  0.589598 -0.554824 -2.416094
H  3.167703 -2.461847 1.318998
H  2.422711 -2.093208 -2.886988
H  -1.545105 2.265127 2.520462
H  -2.71609 4.962497 -0.384287
elementType: Cl O N C H
totalener: -1777.71927243 hartree
nucrepener: 2023.79932651 hartree
electener: -3801.51859894 hartree
oneelecener: -6461.07463568 hartree
twoeener: 2659.55603674 hartree
cpcmener: -0.02675548 hartree
kineticenergy: 1772.82075828 hartree
xcener: -124.641720861415 hartree
chargesum: -0.0000000
charge: -0.076439 -0.083342 -0.406882 -0.369819 0.131681 -0.344025 -0.415834 0.590478 0.156648 0.019059 -0.131721 -0.136343 -0.130708 -0.272080 -0.012297 -0.124781 -0.155394 -0.190774 0.064679 0.120441 0.052343 0.091381 0.113455 0.095952 0.132821 0.152725 0.069363 0.055787 0.085328 0.077940 0.095418 0.151514 0.122644 0.147449 0.162829 0.160506
qa: -0.0764 -0.0833 -0.4069 -0.3698 0.1317 -0.3440 -0.4158 0.5905 0.1566 0.0191 -0.1317 -0.1363 -0.1307 -0.2721 -0.0123 -0.1248 -0.1554 -0.1908 0.0647 0.1204 0.0523 0.0914 0.1135 0.0960 0.1328 0.1527 0.0694 0.0558 0.0853 0.0779 0.0954 0.1515 0.1226 0.1474 0.1628 0.1605
va: 1.2435 1.2207 1.9919 1.9870 3.3670 2.8855 3.0101 3.8648 3.8856 3.9161 3.8007 3.5628 3.9423 3.9592 4.0050 3.9431 4.0897 4.0559 4.0600 3.8521 4.0490 0.9986 0.9970 1.0055 1.0218 1.0157 1.0162 1.0125 1.0027 1.0054 1.0020 1.0235 1.0261 1.0065 1.0074 0.9977
dispcorr: -0.020749091 hartree
energy: -1777.740021517052
dipole: -31.88939 31.89325 0.00386 10.27844 -11.83415 -1.55571 -9.22855 8.68964 -0.53891
magnitude: 1.64641 au
magnitude: 4.18484 debye
