program: Orca
programVersion: 4.2.1
elementType: Cl Cl O O N N N C C C C C C C C C C C C C C H H H H H H H H H H H H H H H
charge: 0
multiplicity: 1
keywords: wb97x-d3
keywords: def2-TZVPP
keywords: def2/J RIJCOSX GRIDX6 NOFINALGRIDX
keywords: grid4 nofinalgrid
keywords: scfconv7
keywords: smallprint printgap noloewdin
keywords: NOSOSCF
formula: C14H15Cl2N3O2
InChI: InChI=1/C14H15Cl2N3O2/c1-2-11-6-20-14(21-11,7-19-9-17-8-18-19)12-4-3-10(15)5-13(12)16/h3-5,8-9,11H,2,6-7H2,1H3
36 atoms
Cl 0.774896 -1.423575 2.495174
Cl 4.529144 -1.439414 -1.279898
O  -1.913323 0.039355 -0.815381
O  -1.797222 -1.228093 1.03767
N  -0.57836 2.188013 0.599491
N  -1.262673 3.011769 -0.199191
N  0.913361 3.562214 -0.184414
C  -1.163303 -0.19501 0.341332
C  -3.016157 -0.867061 -0.867082
C  -2.561626 -1.955826 0.088558
C  -1.190441 1.052994 1.239721
C  0.266939 -0.560129 -0.053553
C  -4.314065 -0.190183 -0.459606
C  -4.616072 1.063229 -1.265149
C  1.18973 -1.091617 0.846365
C  0.71886 -0.300764 -1.344352
C  2.498166 -1.368427 0.478841
C  2.019224 -0.564061 -1.738867
C  0.712882 2.524135 0.588524
C  2.900044 -1.10056 -0.817323
C  -0.329357 3.814398 -0.63782
H  -3.094085 -1.235919 -1.892672
H  -3.379317 -2.453719 0.608095
H  -1.951841 -2.713097 -0.415067
H  -0.669573 0.865659 2.177057
H  -2.221955 1.306968 1.479126
H  -4.29349 0.047539 0.608548
H  -5.116343 -0.920704 -0.595335
H  -3.860824 1.83283 -1.104828
H  -4.65723 0.85031 -2.335224
H  -5.580116 1.483913 -0.978154
H  0.040469 0.12087 -2.071201
H  3.189995 -1.78446 1.197778
H  2.333166 -0.349594 -2.750489
H  1.460767 2.008175 1.170347
H  -0.556275 4.625857 -1.311079
elementType: Cl O N C H
totalener: -1777.71585335 hartree
nucrepener: 2056.42907587 hartree
electener: -3834.14492923 hartree
oneelecener: -6526.62620160 hartree
twoeener: 2692.48127237 hartree
cpcmener: -0.02613553 hartree
kineticenergy: 1772.82923149 hartree
xcener: -124.642953119974 hartree
chargesum: -0.0000000
charge: -0.072168 -0.082800 -0.397520 -0.372632 0.149985 -0.359621 -0.409140 0.559077 0.166080 0.013802 -0.147035 -0.148326 -0.158919 -0.270183 -0.004293 -0.120419 -0.132083 -0.175946 0.038577 0.116437 0.076435 0.100324 0.106684 0.092925 0.153834 0.123936 0.070483 0.079527 0.073115 0.083763 0.093683 0.148614 0.121412 0.148295 0.173005 0.161095
qa: -0.0722 -0.0828 -0.3975 -0.3726 0.1500 -0.3596 -0.4091 0.5591 0.1661 0.0138 -0.1470 -0.1483 -0.1589 -0.2702 -0.0043 -0.1204 -0.1321 -0.1759 0.0386 0.1164 0.0764 0.1003 0.1067 0.0929 0.1538 0.1239 0.0705 0.0795 0.0731 0.0838 0.0937 0.1486 0.1214 0.1483 0.1730 0.1611
va: 1.2483 1.2209 1.9723 1.9931 3.3028 2.8712 3.0266 3.9235 3.8780 3.9874 3.8534 3.5829 3.9100 3.9274 3.9725 3.8698 4.0815 4.0582 4.0828 3.8565 4.0159 0.9949 0.9926 1.0024 1.0120 1.0203 1.0097 1.0120 1.0226 1.0007 1.0055 1.0282 1.0255 1.0047 0.9928 0.9942
dispcorr: -0.021467224 hartree
energy: -1777.737320578248
dipole: -33.93608 32.59502 -1.34106 7.01460 -8.59667 -1.58207 -7.46117 7.49191 0.03074
magnitude: 2.07421 au
magnitude: 5.27222 debye
