program: Orca
programVersion: 4.2.1
elementType: Cl Cl O O N N N C C C C C C C C C C C C C C H H H H H H H H H H H H H H H
charge: 0
multiplicity: 1
keywords: wb97x-d3
keywords: def2-TZVPP
keywords: def2/J RIJCOSX GRIDX6 NOFINALGRIDX
keywords: grid4 nofinalgrid
keywords: scfconv7
keywords: smallprint printgap noloewdin
keywords: NOSOSCF
formula: C14H15Cl2N3O2
InChI: InChI=1/C14H15Cl2N3O2/c1-2-11-6-20-14(21-11,7-19-9-17-8-18-19)12-4-3-10(15)5-13(12)16/h3-5,8-9,11H,2,6-7H2,1H3
36 atoms
Cl 1.284959 -0.823664 2.382091
Cl 4.096334 -3.438463 -1.308223
O  -1.279246 0.463385 -1.098468
O  -1.23084 -0.070444 1.048332
N  -0.830663 2.753363 0.51864
N  -1.36259 2.987245 1.720443
N  -2.285445 4.330336 0.175422
C  -0.425183 0.366556 0.000106
C  -2.226503 -0.602317 -0.996723
C  -2.120768 -1.016431 0.482379
C  0.166033 1.740765 0.299178
C  0.719984 -0.610414 -0.288409
C  -3.598469 -0.141702 -1.44905
C  -4.17931 1.034672 -0.681289
C  1.513344 -1.183384 0.70364
C  1.029344 -0.925037 -1.608635
C  2.549295 -2.054991 0.400072
C  2.058807 -1.787875 -1.942021
C  -1.399715 3.546871 -0.388611
C  2.808292 -2.352803 -0.925629
C  -2.221806 3.937184 1.461366
H  -1.908101 -1.431276 -1.637709
H  -3.069116 -0.963264 1.017636
H  -1.7304 -2.033666 0.582223
H  0.786722 2.047827 -0.542512
H  0.810025 1.695671 1.175029
H  -4.261601 -1.007043 -1.365451
H  -3.555034 0.096469 -2.514639
H  -4.238573 0.844454 0.39137
H  -3.595921 1.942171 -0.826244
H  -5.192641 1.24201 -1.025811
H  0.452874 -0.484868 -2.409872
H  3.144487 -2.489643 1.190606
H  2.265494 -2.010974 -2.978938
H  -1.124361 3.538647 -1.430979
H  -2.829088 4.372762 2.238874
elementType: Cl O N C H
totalener: -1777.71793671 hartree
nucrepener: 2031.66660460 hartree
electener: -3809.38454131 hartree
oneelecener: -6476.95293246 hartree
twoeener: 2667.56839115 hartree
cpcmener: -0.03034228 hartree
kineticenergy: 1772.82824815 hartree
xcener: -124.643587003417 hartree
chargesum: -0.0000000
charge: -0.074277 -0.083382 -0.407263 -0.360528 0.151910 -0.356493 -0.418001 0.590472 0.121990 0.016318 -0.104114 -0.122750 -0.133162 -0.274761 -0.022921 -0.151193 -0.149136 -0.192112 0.042920 0.117671 0.057443 0.097091 0.103718 0.094762 0.142191 0.135702 0.077339 0.073685 0.078288 0.081878 0.102084 0.157067 0.122110 0.148412 0.175056 0.161987
qa: -0.0743 -0.0834 -0.4073 -0.3605 0.1519 -0.3565 -0.4180 0.5905 0.1220 0.0163 -0.1041 -0.1228 -0.1332 -0.2748 -0.0229 -0.1512 -0.1491 -0.1921 0.0429 0.1177 0.0574 0.0971 0.1037 0.0948 0.1422 0.1357 0.0773 0.0737 0.0783 0.0819 0.1021 0.1571 0.1221 0.1484 0.1751 0.1620
va: 1.2452 1.2207 1.9852 1.9949 3.3548 2.8898 2.9962 3.8770 3.8616 3.9095 3.7870 3.5540 3.9495 3.9339 4.0087 3.9634 4.0803 4.0546 4.0584 3.8560 4.0508 0.9985 0.9953 1.0019 1.0031 1.0285 1.0080 1.0096 1.0059 1.0113 1.0041 1.0188 1.0261 1.0058 0.9970 0.9961
dispcorr: -0.021063643 hartree
energy: -1777.739000355067
dipole: -29.83195 30.06080 0.22885 10.77294 -12.26091 -1.48796 -9.18867 7.46033 -1.72835
magnitude: 2.29207 au
magnitude: 5.82598 debye
