program: Orca
programVersion: 4.2.1
elementType: Cl Cl O O N N N C C C C C C C C C C C C C C H H H H H H H H H H H H H H H
charge: 0
multiplicity: 1
keywords: wb97x-d3
keywords: def2-TZVPP
keywords: def2/J RIJCOSX GRIDX6 NOFINALGRIDX
keywords: grid4 nofinalgrid
keywords: scfconv7
keywords: smallprint printgap noloewdin
keywords: NOSOSCF
formula: C14H15Cl2N3O2
InChI: InChI=1/C14H15Cl2N3O2/c1-2-11-6-20-14(21-11,7-19-9-17-8-18-19)12-4-3-10(15)5-13(12)16/h3-5,8-9,11H,2,6-7H2,1H3
36 atoms
Cl 0.197689 -0.575587 -2.717531
Cl 4.495001 -1.831504 0.170273
O  -2.06195 -0.610396 -0.831121
O  -1.786394 0.057089 1.285922
N  -0.299507 2.403695 0.283425
N  -0.552128 2.819754 1.525697
N  1.498533 3.45533 0.888065
C  -1.226182 0.129737 0.013854
C  -3.00483 -1.348439 -0.051075
C  -2.445901 -1.196477 1.357225
C  -1.236286 1.593555 -0.449107
C  0.199441 -0.424638 0.015972
C  -4.403649 -0.781343 -0.231798
C  -5.471219 -1.665652 0.393931
C  0.904301 -0.740483 -1.143926
C  0.880013 -0.548129 1.224197
C  2.220893 -1.176021 -1.106084
C  2.192194 -0.983266 1.292647
C  0.929049 2.782093 -0.080449
C  2.853288 -1.295327 0.118437
C  0.550717 3.445847 1.846002
H  -2.979744 -2.391667 -0.379166
H  -3.204243 -1.142743 2.137843
H  -1.747325 -2.002363 1.608175
H  -2.237481 2.008565 -0.329372
H  -0.977237 1.649767 -1.50501
H  -4.602276 -0.676206 -1.301429
H  -4.451773 0.224402 0.197311
H  -5.331093 -1.784583 1.470006
H  -6.462976 -1.238029 0.245852
H  -5.474628 -2.662947 -0.049871
H  0.378411 -0.291534 2.146686
H  2.742708 -1.413714 -2.022577
H  2.68639 -1.067331 2.250375
H  1.351574 2.55852 -1.047951
H  0.674925 3.92214 2.806225
elementType: Cl O N C H
totalener: -1777.72573186 hartree
nucrepener: 2043.41925873 hartree
electener: -3821.14499059 hartree
oneelecener: -6500.59169089 hartree
twoeener: 2679.44670030 hartree
cpcmener: -0.02508277 hartree
kineticenergy: 1772.80289922 hartree
xcener: -124.636836088233 hartree
chargesum: 0.0000000
charge: -0.071390 -0.081628 -0.383117 -0.372668 0.127659 -0.346509 -0.399468 0.607287 0.190262 -0.028259 -0.145877 -0.107765 -0.147914 -0.268800 -0.070718 -0.137174 -0.119176 -0.176166 0.060959 0.109614 0.061850 0.086252 0.110109 0.100969 0.123222 0.138052 0.068683 0.072236 0.077660 0.093678 0.083574 0.148292 0.121163 0.146517 0.167642 0.160949
qa: -0.0714 -0.0816 -0.3831 -0.3727 0.1277 -0.3465 -0.3995 0.6073 0.1903 -0.0283 -0.1459 -0.1078 -0.1479 -0.2688 -0.0707 -0.1372 -0.1192 -0.1762 0.0610 0.1096 0.0619 0.0863 0.1101 0.1010 0.1232 0.1381 0.0687 0.0722 0.0777 0.0937 0.0836 0.1483 0.1212 0.1465 0.1676 0.1609
va: 1.2481 1.2224 2.0195 1.9883 3.3410 2.8883 3.0319 3.8120 3.8851 3.9680 3.9175 3.6080 3.9193 3.9422 4.0301 3.8597 4.0632 4.0660 4.0648 3.8711 4.0509 0.9983 0.9994 0.9971 1.0234 1.0133 1.0169 1.0119 1.0050 1.0033 1.0017 1.0272 1.0246 1.0052 0.9958 0.9959
dispcorr: -0.020727587 hartree
energy: -1777.746459446508
dipole: -34.12717 32.61050 -1.51667 -0.64917 -0.68302 -1.33219 9.30153 -9.48256 -0.18103
magnitude: 2.02677 au
magnitude: 5.15163 debye
