program: Orca
programVersion: 4.2.1
elementType: Cl Cl O O N N N C C C C C C C C C C C C C C H H H H H H H H H H H H H H H
charge: 0
multiplicity: 1
keywords: wb97x-d3
keywords: def2-TZVPP
keywords: def2/J RIJCOSX GRIDX6 NOFINALGRIDX
keywords: grid4 nofinalgrid
keywords: scfconv7
keywords: smallprint printgap noloewdin
keywords: NOSOSCF
formula: C14H15Cl2N3O2
InChI: InChI=1/C14H15Cl2N3O2/c1-2-11-6-20-14(21-11,7-19-9-17-8-18-19)12-4-3-10(15)5-13(12)16/h3-5,8-9,11H,2,6-7H2,1H3
36 atoms
Cl 1.171075 0.364416 -2.162858
Cl 4.258641 -3.606208 -0.404025
O  -1.268429 0.184656 -0.534747
O  -1.156887 -0.313014 1.638577
N  -0.899836 2.519422 0.927073
N  -1.650764 2.731891 2.009848
N  -2.331534 4.029417 0.315547
C  -0.401327 0.131965 0.55766
C  -2.451354 -0.564075 -0.250519
C  -2.140793 -1.183872 1.109797
C  0.139109 1.528513 0.891581
C  0.772672 -0.808784 0.278416
C  -3.672732 0.336579 -0.241925
C  -3.919257 1.044684 -1.563662
C  1.517365 -0.770077 -0.899807
C  1.158896 -1.733943 1.243329
C  2.589354 -1.622618 -1.11659
C  2.219496 -2.603164 1.050743
C  -1.322409 3.29155 -0.076962
C  2.926794 -2.538853 -0.136061
C  -2.491703 3.646801 1.598652
H  -2.565619 -1.3372 -1.01666
H  -2.993626 -1.196236 1.788309
H  -1.75904 -2.206182 1.015189
H  0.875761 1.841107 0.154318
H  0.64086 1.502943 1.858184
H  -3.584422 1.063506 0.571067
H  -4.536315 -0.289978 -0.000214
H  -3.075773 1.669925 -1.854968
H  -4.09777 0.329547 -2.369563
H  -4.796155 1.689676 -1.499052
H  0.619601 -1.782875 2.179195
H  3.149446 -1.57009 -2.039909
H  2.486228 -3.313731 1.820643
H  -0.86526 3.288093 -1.053887
H  -3.246979 4.05948 2.249573
elementType: Cl O N C H
totalener: -1777.72649437 hartree
nucrepener: 2040.45285774 hartree
electener: -3818.17935211 hartree
oneelecener: -6494.46692177 hartree
twoeener: 2676.28756966 hartree
cpcmener: -0.02385529 hartree
kineticenergy: 1772.79995926 hartree
xcener: -124.637596519768 hartree
chargesum: -0.0000000
charge: -0.073124 -0.082294 -0.364685 -0.367157 0.151733 -0.358572 -0.400368 0.590071 0.166476 -0.028546 -0.151652 -0.072186 -0.141124 -0.285081 -0.075880 -0.145752 -0.139999 -0.176876 0.051472 0.107069 0.054699 0.083363 0.105891 0.101029 0.147689 0.134022 0.066702 0.085012 0.089526 0.088143 0.094694 0.154779 0.122256 0.145519 0.163599 0.159551
qa: -0.0731 -0.0823 -0.3647 -0.3672 0.1517 -0.3586 -0.4004 0.5901 0.1665 -0.0285 -0.1517 -0.0722 -0.1411 -0.2851 -0.0759 -0.1458 -0.1400 -0.1769 0.0515 0.1071 0.0547 0.0834 0.1059 0.1010 0.1477 0.1340 0.0667 0.0850 0.0895 0.0881 0.0947 0.1548 0.1223 0.1455 0.1636 0.1596
va: 1.2470 1.2221 2.0132 2.0097 3.3273 2.8779 3.0102 3.8583 3.8662 3.9761 3.8080 3.5673 3.8845 3.9325 4.0614 3.9237 4.0654 4.0415 4.0624 3.8707 4.0415 0.9994 1.0000 0.9953 1.0100 1.0234 1.0150 1.0151 1.0059 1.0015 1.0043 1.0188 1.0251 1.0071 1.0020 0.9978
dispcorr: -0.021441169 hartree
energy: -1777.747935539130
dipole: -29.64556 29.81709 0.17153 8.10392 -9.67721 -1.57329 5.05211 -4.99688 0.05523
magnitude: 1.58358 au
magnitude: 4.02514 debye
