program: Orca
programVersion: 4.2.1
elementType: Cl Cl O O N N N C C C C C C C C C C C C C C H H H H H H H H H H H H H H H
charge: 0
multiplicity: 1
keywords: wb97x-d3
keywords: def2-TZVPP
keywords: def2/J RIJCOSX GRIDX6 NOFINALGRIDX
keywords: grid4 nofinalgrid
keywords: scfconv7
keywords: smallprint printgap noloewdin
keywords: NOSOSCF
formula: C14H15Cl2N3O2
InChI: InChI=1/C14H15Cl2N3O2/c1-2-11-6-20-14(21-11,7-19-9-17-8-18-19)12-4-3-10(15)5-13(12)16/h3-5,8-9,11H,2,6-7H2,1H3
36 atoms
Cl 0.660425 -1.481527 2.425272
Cl 4.386264 -1.648581 -1.376929
O  -1.903874 0.380748 -0.785588
O  -1.886634 -0.976293 0.994861
N  -0.374246 2.331302 0.701067
N  -0.971245 3.180224 -0.137993
N  1.207156 3.66626 0.049799
C  -1.167447 0.02553 0.348378
C  -2.972573 -0.547076 -0.979983
C  -2.600827 -1.666485 -0.016139
C  -1.083508 1.230564 1.297862
C  0.226151 -0.444885 -0.072597
C  -4.307866 0.119377 -0.688791
C  -5.491047 -0.749062 -1.087665
C  1.099738 -1.103562 0.791963
C  0.694637 -0.164076 -1.352909
C  2.375797 -1.480271 0.399745
C  1.964307 -0.525168 -1.770765
C  0.92461 2.630171 0.799998
C  2.795956 -1.18631 -0.885139
C  0.012573 3.961287 -0.501057
H  -2.947047 -0.890549 -2.018546
H  -3.455151 -2.164139 0.442309
H  -1.974704 -2.427028 -0.495955
H  -0.578207 0.95858 2.223172
H  -2.09046 1.560355 1.552026
H  -4.349315 1.064289 -1.236554
H  -4.370397 0.371151 0.374717
H  -6.432029 -0.236999 -0.885544
H  -5.470661 -0.987891 -2.152892
H  -5.514844 -1.692637 -0.539117
H  0.054295 0.355664 -2.051067
H  3.028989 -1.994352 1.091295
H  2.293193 -0.289612 -2.773291
H  1.609248 2.080737 1.427857
H  -0.137382 4.782275 -1.185156
elementType: Cl O N C H
totalener: -1777.72490785 hartree
nucrepener: 2040.71426820 hartree
electener: -3818.43917605 hartree
oneelecener: -6495.11559227 hartree
twoeener: 2676.67641622 hartree
cpcmener: -0.02398213 hartree
kineticenergy: 1772.79985488 hartree
xcener: -124.636357298787 hartree
chargesum: -0.0000000
charge: -0.071949 -0.081101 -0.388213 -0.362932 0.125142 -0.342622 -0.402174 0.569050 0.151945 0.015062 -0.122840 -0.178112 -0.138665 -0.269147 -0.005618 -0.107428 -0.132932 -0.183203 0.053238 0.118168 0.064461 0.090262 0.109874 0.091684 0.145489 0.118437 0.069310 0.068593 0.093995 0.083486 0.077418 0.147877 0.120796 0.145658 0.166759 0.160232
qa: -0.0719 -0.0811 -0.3882 -0.3629 0.1251 -0.3426 -0.4022 0.5691 0.1519 0.0151 -0.1228 -0.1781 -0.1387 -0.2691 -0.0056 -0.1074 -0.1329 -0.1832 0.0532 0.1182 0.0645 0.0903 0.1099 0.0917 0.1455 0.1184 0.0693 0.0686 0.0940 0.0835 0.0774 0.1479 0.1208 0.1457 0.1668 0.1602
va: 1.2490 1.2226 1.9976 2.0002 3.3423 2.8939 3.0326 3.9014 3.9024 3.9463 3.8700 3.6039 3.9254 3.9450 3.9692 3.8645 4.0803 4.0691 4.0743 3.8593 4.0429 0.9972 0.9950 1.0043 1.0126 1.0262 1.0166 1.0126 1.0033 1.0016 1.0048 1.0279 1.0253 1.0058 0.9949 0.9957
dispcorr: -0.020714086 hartree
energy: -1777.745621935024
dipole: -35.12671 33.77013 -1.35659 4.36291 -5.81228 -1.44937 -7.17890 7.09943 -0.07946
magnitude: 1.98679 au
magnitude: 5.05001 debye
