program: Orca
programVersion: 4.2.1
elementType: Cl Cl O O N N N C C C C C C C C C C C C C C H H H H H H H H H H H H H H H
charge: 0
multiplicity: 1
keywords: wb97x-d3
keywords: def2-TZVPP
keywords: def2/J RIJCOSX GRIDX6 NOFINALGRIDX
keywords: grid4 nofinalgrid
keywords: scfconv7
keywords: smallprint printgap noloewdin
keywords: NOSOSCF
formula: C14H15Cl2N3O2
InChI: InChI=1/C14H15Cl2N3O2/c1-2-11-6-20-14(21-11,7-19-9-17-8-18-19)12-4-3-10(15)5-13(12)16/h3-5,8-9,11H,2,6-7H2,1H3
36 atoms
Cl 1.303051 0.400737 -2.215509
Cl 4.169546 -3.674769 -0.329995
O  -1.193532 0.403868 -0.633403
O  -1.135303 -0.158895 1.539991
N  -0.742614 2.637271 0.961767
N  -1.379514 2.818724 2.120921
N  -2.246977 4.140195 0.534667
C  -0.348014 0.265824 0.4626
C  -2.390329 -0.327303 -0.392757
C  -2.483033 -0.290743 1.124901
C  0.271597 1.633459 0.79657
C  0.76837 -0.745685 0.214593
C  -3.54857 0.330388 -1.112504
C  -4.866988 -0.377484 -0.833171
C  1.558948 -0.737723 -0.934435
C  1.069831 -1.69563 1.186236
C  2.601629 -1.635098 -1.111443
C  2.103925 -2.603622 1.035102
C  -1.275681 3.424163 0.023514
C  2.865184 -2.562213 -0.118799
C  -2.268483 3.729947 1.818976
H  -2.270894 -1.361257 -0.743741
H  -3.07437 0.561292 1.479505
H  -2.901968 -1.203659 1.549029
H  0.9466 1.956676 0.0062
H  0.852314 1.560605 1.714789
H  -3.352654 0.328955 -2.187219
H  -3.616149 1.376915 -0.801084
H  -4.834019 -1.426729 -1.131745
H  -5.135374 -0.341221 0.224395
H  -5.67984 0.094493 -1.385126
H  0.484006 -1.732377 2.09318
H  3.19893 -1.60599 -2.012224
H  2.308533 -3.327925 1.811229
H  -0.923218 3.44587 -0.995673
H  -2.95663 4.118654 2.553625
elementType: Cl O N C H
totalener: -1777.72738199 hartree
nucrepener: 2020.83826924 hartree
electener: -3798.56565123 hartree
oneelecener: -6455.20352077 hartree
twoeener: 2656.63786954 hartree
cpcmener: -0.02248121 hartree
kineticenergy: 1772.80003655 hartree
xcener: -124.638401674746 hartree
chargesum: -0.0000000
charge: -0.074962 -0.081930 -0.371195 -0.392456 0.147564 -0.360850 -0.409717 0.565469 0.174255 -0.025353 -0.136817 -0.065911 -0.123875 -0.272792 -0.030625 -0.149780 -0.146596 -0.170336 0.048753 0.108167 0.064953 0.086869 0.083972 0.112308 0.144640 0.131192 0.075393 0.062413 0.088297 0.082728 0.096739 0.148953 0.122095 0.144446 0.163441 0.160549
qa: -0.0750 -0.0819 -0.3712 -0.3925 0.1476 -0.3608 -0.4097 0.5655 0.1743 -0.0254 -0.1368 -0.0659 -0.1239 -0.2728 -0.0306 -0.1498 -0.1466 -0.1703 0.0488 0.1082 0.0650 0.0869 0.0840 0.1123 0.1446 0.1312 0.0754 0.0624 0.0883 0.0827 0.0967 0.1490 0.1221 0.1444 0.1634 0.1605
va: 1.2438 1.2224 2.0044 1.9807 3.3425 2.8775 3.0031 3.8724 3.8247 3.9681 3.8191 3.6050 3.9487 3.9504 4.0071 3.9644 4.0759 4.0384 4.0702 3.8661 4.0323 1.0048 0.9957 0.9967 1.0157 1.0217 1.0099 1.0130 1.0013 1.0016 1.0034 1.0267 1.0253 1.0072 1.0030 0.9957
dispcorr: -0.020396136 hartree
energy: -1777.747778127103
dipole: -32.58861 32.45469 -0.13391 6.54882 -7.80472 -1.25590 5.38412 -5.58661 -0.20249
magnitude: 1.27915 au
magnitude: 3.25133 debye
