program: Orca
programVersion: 4.2.1
elementType: Cl Cl O O N N N C C C C C C C C C C C C C C H H H H H H H H H H H H H H H
charge: 0
multiplicity: 1
keywords: wb97x-d3
keywords: def2-TZVPP
keywords: def2/J RIJCOSX GRIDX6 NOFINALGRIDX
keywords: grid4 nofinalgrid
keywords: scfconv7
keywords: smallprint printgap noloewdin
keywords: NOSOSCF
formula: C14H15Cl2N3O2
InChI: InChI=1/C14H15Cl2N3O2/c1-2-11-6-20-14(21-11,7-19-9-17-8-18-19)12-4-3-10(15)5-13(12)16/h3-5,8-9,11H,2,6-7H2,1H3
36 atoms
Cl 0.841472 -1.291729 2.592289
Cl 4.048369 -1.655077 -1.643898
O  -2.195154 0.21574 -0.37544
O  -1.864871 -0.916122 1.511095
N  -0.357762 2.315855 0.73611
N  -0.873541 3.02088 -0.27419
N  1.304828 3.494094 -0.019504
C  -1.285876 0.026228 0.65637
C  -2.809151 -1.038476 -0.618878
C  -2.777298 -1.695095 0.767595
C  -1.130262 1.334333 1.443194
C  0.062906 -0.443269 0.109503
C  -4.192427 -0.830455 -1.196139
C  -4.179324 -0.136588 -2.549985
C  1.050768 -1.035078 0.892783
C  0.370028 -0.204914 -1.227433
C  2.274018 -1.414356 0.359544
C  1.583916 -0.568177 -1.781576
C  0.946511 2.603924 0.867454
C  2.529371 -1.183295 -0.979979
C  0.156502 3.713847 -0.693836
H  -2.201524 -1.621097 -1.326638
H  -3.754441 -1.663681 1.258545
H  -2.451175 -2.736848 0.718679
H  -0.630085 1.12139 2.387429
H  -2.117408 1.7419 1.660878
H  -4.7927 -0.259273 -0.48244
H  -4.668314 -1.811407 -1.287278
H  -3.598975 -0.7027 -3.27996
H  -5.189929 -0.035306 -2.94344
H  -3.748386 0.86124 -2.480896
H  -0.360612 0.291291 -1.850865
H  3.019554 -1.878722 0.988989
H  1.792839 -0.36693 -2.822512
H  1.577821 2.147698 1.614936
H  0.075031 4.411676 -1.512225
totalener: -1777.69983099 hartree
nucrepener: 2057.50695701 hartree
electener: -3835.20678800 hartree
oneelecener: -6528.43564770 hartree
twoeener: 2693.22885970 hartree
kineticenergy: 1772.82092014 hartree
xcener: -124.638082981497 hartree
chargesum: -0.0000000
charge: -0.056507 -0.064417 -0.334626 -0.335273 0.113613 -0.306072 -0.322595 0.604645 0.065909 0.043106 -0.127088 -0.127828 -0.120028 -0.250871 -0.070706 -0.143153 -0.127366 -0.140151 0.039736 0.103575 0.058721 0.078849 0.072472 0.073062 0.129157 0.107590 0.060584 0.065114 0.068212 0.088377 0.101657 0.143610 0.112488 0.124927 0.141122 0.130159
qa: -0.0565 -0.0644 -0.3346 -0.3353 0.1136 -0.3061 -0.3226 0.6046 0.0659 0.0431 -0.1271 -0.1278 -0.1200 -0.2509 -0.0707 -0.1432 -0.1274 -0.1402 0.0397 0.1036 0.0587 0.0788 0.0725 0.0731 0.1292 0.1076 0.0606 0.0651 0.0682 0.0884 0.1017 0.1436 0.1125 0.1249 0.1411 0.1302
va: 1.2647 1.2408 2.0380 2.0364 3.3212 2.8607 3.0632 3.7979 3.9105 3.9809 3.8905 3.6289 3.9454 3.9265 4.0359 3.8946 4.0616 4.0638 4.0753 3.9382 4.0449 0.9915 0.9951 0.9952 1.0132 1.0357 1.0176 1.0083 1.0053 1.0061 1.0102 1.0218 1.0276 1.0127 1.0035 1.0018
dispcorr: -0.021053124 hartree
energy: -1777.720884114322
dipole: -31.76489 30.66572 -1.09917 3.62667 -4.69443 -1.06777 -10.07028 10.04213 -0.02815
magnitude: 1.53267 au
magnitude: 3.89574 debye
