program: Orca
programVersion: 4.2.1
elementType: Cl Cl O O N N N C C C C C C C C C C C C C C H H H H H H H H H H H H H H H
charge: 0
multiplicity: 1
keywords: wb97x-d3
keywords: def2-TZVPP
keywords: def2/J RIJCOSX GRIDX6 NOFINALGRIDX
keywords: grid4 nofinalgrid
keywords: scfconv7
keywords: smallprint printgap noloewdin
keywords: NOSOSCF
formula: C14H15Cl2N3O2
InChI: InChI=1/C14H15Cl2N3O2/c1-2-11-6-20-14(21-11,7-19-9-17-8-18-19)12-4-3-10(15)5-13(12)16/h3-5,8-9,11H,2,6-7H2,1H3
36 atoms
Cl 0.128873 -0.80975 -2.597977
Cl 4.248628 -2.053254 0.540355
O  -2.175495 -0.517332 -0.766235
O  -1.901748 0.357016 1.252783
N  -0.338799 2.5111 0.084777
N  0.910167 2.694122 -0.355122
N  0.616503 3.72084 1.616075
C  -1.308098 0.261309 -0.012572
C  -2.689994 -1.51509 0.095718
C  -2.583217 -0.858887 1.487193
C  -1.25535 1.662471 -0.625282
C  0.084735 -0.355623 0.097197
C  -4.090836 -1.910523 -0.336575
C  -5.068514 -0.753049 -0.479572
C  0.788656 -0.846369 -1.000477
C  0.726768 -0.386497 1.330666
C  2.064769 -1.371735 -0.87034
C  2.001211 -0.902183 1.486481
C  -0.494112 3.124639 1.268265
C  2.661541 -1.399024 0.377355
C  1.44429 3.425073 0.59096
H  -2.044162 -2.401869 0.057354
H  -3.554388 -0.631203 1.931153
H  -2.03158 -1.496614 2.184917
H  -2.256925 2.095003 -0.602208
H  -0.92534 1.611051 -1.660303
H  -4.466117 -2.635797 0.391654
H  -4.023119 -2.45006 -1.284013
H  -5.189359 -0.19086 0.447421
H  -4.749193 -0.055419 -1.251532
H  -6.054336 -1.124043 -0.757982
H  0.221488 0.015676 2.197368
H  2.587591 -1.747151 -1.738217
H  2.474187 -0.910344 2.458068
H  -1.418231 3.109786 1.824207
H  2.467377 3.762476 0.538968
totalener: -1777.70061207 hartree
nucrepener: 2058.92228493 hartree
electener: -3836.62289700 hartree
oneelecener: -6531.37435631 hartree
twoeener: 2694.75145931 hartree
kineticenergy: 1772.81453064 hartree
xcener: -124.638937189982 hartree
chargesum: -0.0000000
charge: -0.059684 -0.067974 -0.344058 -0.364073 0.106802 -0.303360 -0.327878 0.587542 0.111974 -0.030910 -0.101121 -0.153296 -0.127612 -0.252279 0.004835 -0.116306 -0.146180 -0.186888 0.036438 0.121572 0.060175 0.087310 0.086026 0.087464 0.112896 0.130820 0.065720 0.077562 0.069114 0.089155 0.093350 0.140645 0.111280 0.124957 0.144694 0.131286
qa: -0.0597 -0.0680 -0.3441 -0.3641 0.1068 -0.3034 -0.3279 0.5875 0.1120 -0.0309 -0.1011 -0.1533 -0.1276 -0.2523 0.0048 -0.1163 -0.1462 -0.1869 0.0364 0.1216 0.0602 0.0873 0.0860 0.0875 0.1129 0.1308 0.0657 0.0776 0.0691 0.0892 0.0934 0.1406 0.1113 0.1250 0.1447 0.1313
va: 1.2633 1.2373 2.0315 1.9890 3.3308 2.8542 3.0640 3.8264 3.8969 3.9737 3.8542 3.6223 3.9283 3.9360 4.0237 3.8895 4.0927 4.1113 4.0822 3.9179 4.0458 0.9999 1.0005 0.9946 1.0194 1.0300 1.0083 1.0097 1.0077 1.0123 1.0058 1.0205 1.0279 1.0136 1.0122 1.0019
dispcorr: -0.021237015 hartree
energy: -1777.721849085257
dipole: -32.56799 31.05870 -1.50929 1.16941 -2.21374 -1.04433 7.24108 -6.95667 0.28441
magnitude: 1.85727 au
magnitude: 4.72081 debye
