program: Orca
programVersion: 4.2.1
elementType: Cl Cl O O N N N C C C C C C C C C C C C C C H H H H H H H H H H H H H H H
charge: 0
multiplicity: 1
keywords: wb97x-d3
keywords: def2-TZVPP
keywords: def2/J RIJCOSX GRIDX6 NOFINALGRIDX
keywords: grid4 nofinalgrid
keywords: scfconv7
keywords: smallprint printgap noloewdin
keywords: NOSOSCF
formula: C14H15Cl2N3O2
InChI: InChI=1/C14H15Cl2N3O2/c1-2-11-6-20-14(21-11,7-19-9-17-8-18-19)12-4-3-10(15)5-13(12)16/h3-5,8-9,11H,2,6-7H2,1H3
36 atoms
Cl 0.720267 -1.102944 2.656804
Cl 4.243212 -1.596512 -1.307655
O  -2.154814 0.013284 -0.632705
O  -1.924483 -1.0144 1.320317
N  -0.465036 2.237748 0.603551
N  -0.799444 2.847563 -0.536227
N  1.282029 3.418101 0.077291
C  -1.32792 -0.073283 0.486137
C  -2.808011 -1.237008 -0.812954
C  -2.443316 -2.008437 0.467255
C  -1.322922 1.271041 1.226347
C  0.085085 -0.484753 0.068185
C  -4.29688 -1.013029 -1.000338
C  -4.627937 -0.136029 -2.198372
C  1.043117 -0.958647 0.961306
C  0.4732 -0.332976 -1.259586
C  2.319635 -1.306089 0.545761
C  1.742364 -0.66576 -1.698222
C  0.785268 2.581106 0.94915
C  2.65843 -1.161937 -0.787775
C  0.274334 3.546953 -0.811243
H  -2.398068 -1.739859 -1.698038
H  -3.306101 -2.466546 0.952765
H  -1.700581 -2.789401 0.270387
H  -0.970244 1.115867 2.244765
H  -2.339559 1.660361 1.269373
H  -4.708887 -0.576909 -0.085295
H  -4.770234 -1.992494 -1.117559
H  -4.24234 -0.567337 -3.123867
H  -5.70592 -0.026764 -2.313114
H  -4.201022 0.860075 -2.092387
H  -0.237428 0.069784 -1.967157
H  3.040687 -1.678448 1.259321
H  2.015378 -0.534235 -2.735502
H  1.276343 2.201762 1.832615
H  0.332721 4.179321 -1.683074
totalener: -1777.69979590 hartree
nucrepener: 2061.48866570 hartree
electener: -3839.18846160 hartree
oneelecener: -6536.42510327 hartree
twoeener: 2697.23664167 hartree
kineticenergy: 1772.82094936 hartree
xcener: -124.637538896738 hartree
chargesum: -0.0000000
charge: -0.058096 -0.064382 -0.348284 -0.319745 0.118079 -0.308733 -0.322050 0.599380 0.100049 0.007143 -0.129083 -0.161027 -0.139732 -0.245963 -0.061709 -0.129713 -0.119605 -0.149862 0.043712 0.105914 0.058237 0.076693 0.091000 0.083810 0.130601 0.109657 0.066485 0.061694 0.067516 0.085113 0.100085 0.145651 0.112508 0.125283 0.139470 0.129903
qa: -0.0581 -0.0644 -0.3483 -0.3197 0.1181 -0.3087 -0.3220 0.5994 0.1000 0.0071 -0.1291 -0.1610 -0.1397 -0.2460 -0.0617 -0.1297 -0.1196 -0.1499 0.0437 0.1059 0.0582 0.0767 0.0910 0.0838 0.1306 0.1097 0.0665 0.0617 0.0675 0.0851 0.1001 0.1457 0.1125 0.1253 0.1395 0.1299
va: 1.2636 1.2409 2.0170 2.0446 3.3183 2.8573 3.0648 3.7961 3.8681 3.9637 3.8760 3.6457 3.9591 3.9330 4.0112 3.9063 4.0551 4.0658 4.0696 3.9365 4.0471 0.9965 0.9961 0.9983 1.0105 1.0314 1.0133 1.0095 1.0048 1.0052 1.0139 1.0268 1.0269 1.0127 1.0065 1.0019
dispcorr: -0.021268571 hartree
energy: -1777.721064472844
dipole: -32.68120 31.63124 -1.04996 2.16264 -3.29810 -1.13545 -10.41864 10.41568 -0.00296
magnitude: 1.54650 au
magnitude: 3.93090 debye
