program: Orca
programVersion: 4.2.1
elementType: Cl Cl O O N N N C C C C C C C C C C C C C C H H H H H H H H H H H H H H H
charge: 0
multiplicity: 1
keywords: wb97x-d3
keywords: def2-TZVPP
keywords: def2/J RIJCOSX GRIDX6 NOFINALGRIDX
keywords: grid4 nofinalgrid
keywords: scfconv7
keywords: smallprint printgap noloewdin
keywords: NOSOSCF
formula: C14H15Cl2N3O2
InChI: InChI=1/C14H15Cl2N3O2/c1-2-11-6-20-14(21-11,7-19-9-17-8-18-19)12-4-3-10(15)5-13(12)16/h3-5,8-9,11H,2,6-7H2,1H3
36 atoms
Cl 0.818696 -0.110431 -2.439803
Cl 4.150245 -3.68236 -0.317605
O  -1.329648 0.194299 -0.467643
O  -0.915067 0.107018 1.717798
N  -0.770099 2.726187 0.663259
N  -1.025014 3.218593 1.879198
N  -2.485609 4.029728 0.382422
C  -0.317325 0.31574 0.480866
C  -2.386754 -0.59363 0.061205
C  -1.966318 -0.811474 1.522952
C  0.249257 1.739742 0.452493
C  0.805542 -0.692802 0.234894
C  -3.709453 0.132215 -0.100217
C  -4.073148 0.408646 -1.550874
C  1.354549 -0.943958 -1.021463
C  1.350821 -1.37947 1.315727
C  2.380154 -1.861293 -1.19704
C  2.374112 -2.29897 1.166619
C  -1.656127 3.21613 -0.217072
C  2.879661 -2.538578 -0.099003
C  -2.056008 3.995938 1.663099
H  -2.423738 -1.548357 -0.477071
H  -2.760582 -0.579397 2.233827
H  -1.634367 -1.841223 1.697437
H  0.737127 1.921062 -0.504984
H  0.995977 1.851968 1.236738
H  -3.680681 1.066666 0.468234
H  -4.486864 -0.486565 0.358252
H  -3.330532 1.039107 -2.03824
H  -4.14987 -0.515989 -2.125692
H  -5.032737 0.920011 -1.618539
H  0.962669 -1.188199 2.306651
H  2.783693 -2.040389 -2.183416
H  2.772755 -2.819783 2.025647
H  -1.650791 2.957263 -1.264141
H  -2.513132 4.566906 2.456186
totalener: -1777.70147077 hartree
nucrepener: 2032.54526066 hartree
electener: -3810.24673144 hartree
oneelecener: -6478.35995850 hartree
twoeener: 2668.11322706 hartree
kineticenergy: 1772.81473431 hartree
xcener: -124.637647244296 hartree
chargesum: -0.0000000
charge: -0.058255 -0.063261 -0.357963 -0.328392 0.128242 -0.293749 -0.334014 0.578539 0.156059 -0.029923 -0.129254 -0.126757 -0.157515 -0.241719 -0.038367 -0.136435 -0.152855 -0.164758 0.007209 0.109541 0.052622 0.072618 0.091673 0.086912 0.137084 0.124361 0.082126 0.076963 0.081828 0.074381 0.091029 0.146932 0.114676 0.126716 0.144065 0.129642
qa: -0.0583 -0.0633 -0.3580 -0.3284 0.1282 -0.2937 -0.3340 0.5785 0.1561 -0.0299 -0.1293 -0.1268 -0.1575 -0.2417 -0.0384 -0.1364 -0.1529 -0.1648 0.0072 0.1095 0.0526 0.0726 0.0917 0.0869 0.1371 0.1244 0.0821 0.0770 0.0818 0.0744 0.0910 0.1469 0.1147 0.1267 0.1441 0.1296
va: 1.2619 1.2420 2.0094 2.0392 3.3411 2.8793 3.0340 3.8804 3.8398 3.9884 3.7971 3.6090 3.9278 3.9441 4.0567 3.9378 4.0784 4.0540 4.0958 3.9289 4.0499 1.0013 1.0020 0.9923 1.0143 1.0261 1.0089 1.0096 1.0111 1.0038 1.0068 1.0226 1.0277 1.0142 1.0061 1.0013
dispcorr: -0.020921385 hartree
energy: -1777.722392156569
dipole: -28.66849 28.68987 0.02138 8.33113 -9.58839 -1.25727 6.20403 -6.17244 0.03158
magnitude: 1.25784 au
magnitude: 3.19719 debye
