program: Orca
programVersion: 4.2.1
elementType: Cl Cl O O N N N C C C C C C C C C C C C C C H H H H H H H H H H H H H H H
charge: 0
multiplicity: 1
keywords: wb97x-d3
keywords: def2-TZVPP
keywords: def2/J RIJCOSX GRIDX6 NOFINALGRIDX
keywords: grid4 nofinalgrid
keywords: scfconv7
keywords: smallprint printgap noloewdin
keywords: NOSOSCF
formula: C14H15Cl2N3O2
InChI: InChI=1/C14H15Cl2N3O2/c1-2-11-6-20-14(21-11,7-19-9-17-8-18-19)12-4-3-10(15)5-13(12)16/h3-5,8-9,11H,2,6-7H2,1H3
36 atoms
Cl 1.258154 0.208834 -2.345794
Cl 4.121034 -3.729362 -0.188366
O  -1.182806 0.359701 -0.726119
O  -1.139161 -0.022108 1.466621
N  -0.7502 2.706166 0.809258
N  -1.172087 3.065784 2.025006
N  -2.338359 4.142084 0.439954
C  -0.338421 0.316343 0.382881
C  -2.356306 -0.398291 -0.467023
C  -2.146703 -0.878036 0.975829
C  0.260754 1.704548 0.632875
C  0.787389 -0.700933 0.191869
C  -3.590343 0.464823 -0.667421
C  -4.875615 -0.349466 -0.617716
C  1.533745 -0.815346 -0.979674
C  1.131446 -1.538259 1.24921
C  2.557086 -1.743995 -1.102131
C  2.147206 -2.472494 1.151688
C  -1.462236 3.35326 -0.12587
C  2.85287 -2.572467 -0.034529
C  -2.121294 3.926616 1.75585
H  -2.390388 -1.249494 -1.157228
H  -3.030396 -0.761556 1.604151
H  -1.831351 -1.927235 1.011814
H  0.901086 1.98058 -0.204705
H  0.874589 1.682165 1.531865
H  -3.513533 0.963442 -1.636387
H  -3.611389 1.256391 0.086822
H  -5.744194 0.288079 -0.775744
H  -4.890935 -1.121162 -1.389225
H  -5.014142 -0.845148 0.34485
H  0.586819 -1.455999 2.179643
H  3.117235 -1.81445 -2.023567
H  2.386559 -3.112161 1.989229
H  -1.304377 3.219472 -1.18433
H  -2.671626 4.428028 2.536433
totalener: -1777.70142711 hartree
nucrepener: 2021.20002777 hartree
electener: -3798.90145488 hartree
oneelecener: -6455.64375302 hartree
twoeener: 2656.74229815 hartree
kineticenergy: 1772.81312779 hartree
xcener: -124.637773244267 hartree
chargesum: -0.0000000
charge: -0.058109 -0.063179 -0.357160 -0.329193 0.125860 -0.293065 -0.333122 0.574980 0.164038 -0.033463 -0.134202 -0.120692 -0.134187 -0.252064 -0.044315 -0.142164 -0.148322 -0.160982 0.011198 0.106204 0.051568 0.068869 0.095476 0.089405 0.138288 0.125028 0.074032 0.075325 0.096126 0.078523 0.067767 0.147368 0.114043 0.126721 0.144291 0.129111
qa: -0.0581 -0.0632 -0.3572 -0.3292 0.1259 -0.2931 -0.3331 0.5750 0.1640 -0.0335 -0.1342 -0.1207 -0.1342 -0.2521 -0.0443 -0.1422 -0.1483 -0.1610 0.0112 0.1062 0.0516 0.0689 0.0955 0.0894 0.1383 0.1250 0.0740 0.0753 0.0961 0.0785 0.0678 0.1474 0.1140 0.1267 0.1443 0.1291
va: 1.2622 1.2423 2.0189 2.0408 3.3425 2.8784 3.0385 3.8795 3.8721 3.9625 3.7997 3.6064 3.9149 3.9481 4.0625 3.9377 4.0753 4.0506 4.0907 3.9318 4.0515 1.0017 1.0038 0.9930 1.0137 1.0260 1.0149 1.0083 1.0052 1.0040 1.0078 1.0229 1.0279 1.0140 1.0104 1.0019
dispcorr: -0.020423261 hartree
energy: -1777.721850371542
dipole: -31.79899 31.73090 -0.06809 6.20257 -7.45557 -1.25300 6.19943 -6.33427 -0.13484
magnitude: 1.26207 au
magnitude: 3.20793 debye
