program: Orca
programVersion: 4.2.1
elementType: Cl Cl O O N N N C C C C C C C C C C C C C C H H H H H H H H H H H H H H H
charge: 0
multiplicity: 1
keywords: wb97x-d3
keywords: def2-TZVPP
keywords: def2/J RIJCOSX GRIDX6 NOFINALGRIDX
keywords: grid4 nofinalgrid
keywords: scfconv7
keywords: smallprint printgap noloewdin
keywords: NOSOSCF
formula: C14H15Cl2N3O2
InChI: InChI=1/C14H15Cl2N3O2/c1-2-11-6-20-14(21-11,7-19-9-17-8-18-19)12-4-3-10(15)5-13(12)16/h3-5,8-9,11H,2,6-7H2,1H3
36 atoms
Cl -0.268887 -0.497754 -2.593081
Cl 4.174165 -2.165959 -0.178444
O  -2.286789 -0.285247 -0.455651
O  -1.71219 0.344614 1.593858
N  -0.203309 2.561374 0.446147
N  0.978919 2.748518 -0.148813
N  1.017688 3.559223 1.940828
C  -1.294126 0.372807 0.253784
C  -2.697086 -1.371781 0.353939
C  -2.502833 -0.815381 1.77399
C  -1.252242 1.830853 -0.209893
C  0.070227 -0.298803 0.113557
C  -4.115228 -1.76947 0.008046
C  -4.258814 -2.292599 -1.413752
C  0.596156 -0.706186 -1.110578
C  0.869313 -0.470357 1.239091
C  1.852632 -1.283933 -1.20562
C  2.129301 -1.037584 1.169674
C  -0.1597 3.044978 1.697273
C  2.61118 -1.446982 -0.060491
C  1.67732 3.349874 0.78133
H  -2.02677 -2.227655 0.189668
H  -3.449988 -0.527554 2.23904
H  -2.00355 -1.535897 2.427727
H  -2.216559 2.296177 -0.00019
H  -1.070823 1.882533 -1.281128
H  -4.774442 -0.911524 0.168203
H  -4.430966 -2.539049 0.718536
H  -3.979756 -1.536884 -2.146436
H  -3.624169 -3.164244 -1.579613
H  -5.28695 -2.590556 -1.616435
H  0.500788 -0.141887 2.200514
H  2.234973 -1.5948 -2.16722
H  2.728265 -1.153357 2.061617
H  -0.995902 3.001776 2.377139
H  2.698493 3.655318 0.616632
totalener: -1777.70201194 hartree
nucrepener: 2057.72711850 hartree
electener: -3835.42913044 hartree
oneelecener: -6529.01021511 hartree
twoeener: 2693.58108466 hartree
kineticenergy: 1772.81532461 hartree
xcener: -124.637549820456 hartree
chargesum: -0.0000000
charge: -0.059799 -0.068217 -0.332434 -0.366369 0.106577 -0.302611 -0.327494 0.577265 0.117812 -0.011514 -0.095904 -0.169325 -0.127843 -0.242353 0.013854 -0.109520 -0.145391 -0.185047 0.036550 0.120800 0.059784 0.078373 0.079675 0.083569 0.111408 0.130094 0.060573 0.065087 0.093361 0.071990 0.087018 0.138616 0.110794 0.124668 0.144395 0.131559
qa: -0.0598 -0.0682 -0.3324 -0.3664 0.1066 -0.3026 -0.3275 0.5773 0.1178 -0.0115 -0.0959 -0.1693 -0.1278 -0.2424 0.0139 -0.1095 -0.1454 -0.1850 0.0366 0.1208 0.0598 0.0784 0.0797 0.0836 0.1114 0.1301 0.0606 0.0651 0.0934 0.0720 0.0870 0.1386 0.1108 0.1247 0.1444 0.1316
va: 1.2632 1.2371 2.0471 1.9908 3.3275 2.8541 3.0643 3.8472 3.8643 3.9942 3.8393 3.6123 3.9554 3.9327 4.0220 3.8931 4.0926 4.1081 4.0818 3.9174 4.0454 1.0006 1.0003 0.9928 1.0230 1.0293 1.0160 1.0092 1.0118 1.0059 1.0060 1.0232 1.0278 1.0135 1.0125 1.0019
dispcorr: -0.021052953 hartree
energy: -1777.723064895624
dipole: -29.25789 27.74284 -1.51504 -2.63536 1.61311 -1.02225 7.82716 -7.47146 0.35571
magnitude: 1.86195 au
magnitude: 4.73271 debye
