program: Orca
programVersion: 4.2.1
elementType: Cl Cl O O N N N C C C C C C C C C C C C C C H H H H H H H H H H H H H H H
charge: 0
multiplicity: 1
keywords: wb97x-d3
keywords: def2-TZVPP
keywords: def2/J RIJCOSX GRIDX6 NOFINALGRIDX
keywords: grid4 nofinalgrid
keywords: scfconv7
keywords: smallprint printgap noloewdin
keywords: NOSOSCF
formula: C14H15Cl2N3O2
InChI: InChI=1/C14H15Cl2N3O2/c1-2-11-6-20-14(21-11,7-19-9-17-8-18-19)12-4-3-10(15)5-13(12)16/h3-5,8-9,11H,2,6-7H2,1H3
36 atoms
Cl 1.602054 -0.418348 2.205456
Cl 4.0607 -3.561114 -1.324082
O  -1.295474 0.371493 -1.164791
O  -1.064613 0.001057 1.040801
N  -0.785598 2.711954 0.472571
N  -1.606999 3.362746 -0.35707
N  -2.152424 3.785496 1.778314
C  -0.374307 0.363049 -0.121642
C  -2.483869 -0.282565 -0.752465
C  -2.445836 -0.07422 0.754369
C  0.203854 1.785422 0.001061
C  0.74897 -0.632595 -0.385618
C  -3.675925 0.331082 -1.455562
C  -4.986625 -0.310665 -1.020717
C  1.663057 -1.031583 0.588275
C  0.909255 -1.158957 -1.662937
C  2.680765 -1.93019 0.306823
C  1.916805 -2.057449 -1.968724
C  -1.131042 2.969251 1.743514
C  2.79802 -2.441153 -0.973768
C  -2.403743 3.997132 0.468138
H  -2.421541 -1.355876 -0.987496
H  -2.963303 0.848577 1.046693
H  -2.875615 -0.904523 1.315837
H  0.564273 2.120389 -0.970805
H  1.044017 1.794546 0.694556
H  -3.550138 0.216173 -2.53457
H  -3.685983 1.405285 -1.255172
H  -5.825745 0.11389 -1.570131
H  -4.988997 -1.386913 -1.202365
H  -5.187339 -0.154343 0.040727
H  0.223092 -0.858304 -2.441835
H  3.372621 -2.226439 1.082278
H  2.013425 -2.452176 -2.970146
H  -0.614245 2.544197 2.59006
H  -3.192778 4.641753 0.113209
totalener: -1777.70224620 hartree
nucrepener: 2019.75854797 hartree
electener: -3797.46079417 hartree
oneelecener: -6452.77870656 hartree
twoeener: 2655.31791239 hartree
kineticenergy: 1772.80242594 hartree
xcener: -124.636516942665 hartree
chargesum: -0.0000000
charge: -0.061939 -0.064941 -0.358298 -0.350441 0.128329 -0.320168 -0.329462 0.574145 0.153255 -0.027709 -0.163770 -0.072048 -0.131713 -0.259297 -0.067938 -0.112831 -0.142900 -0.161556 0.039032 0.101997 0.053313 0.075323 0.085011 0.101522 0.121919 0.139284 0.069364 0.073712 0.093854 0.079926 0.079132 0.141109 0.114645 0.125630 0.141786 0.132721
qa: -0.0619 -0.0649 -0.3583 -0.3504 0.1283 -0.3202 -0.3295 0.5741 0.1533 -0.0277 -0.1638 -0.0720 -0.1317 -0.2593 -0.0679 -0.1128 -0.1429 -0.1616 0.0390 0.1020 0.0533 0.0753 0.0850 0.1015 0.1219 0.1393 0.0694 0.0737 0.0939 0.0799 0.0791 0.1411 0.1146 0.1256 0.1418 0.1327
va: 1.2593 1.2404 2.0385 2.0218 3.3344 2.8572 3.0541 3.8251 3.8466 3.9923 3.8490 3.6340 3.9481 3.9368 4.0706 3.9186 4.0695 4.0520 4.0659 3.9330 4.0237 1.0017 0.9881 0.9968 1.0292 1.0134 1.0120 1.0214 1.0064 1.0028 1.0030 1.0265 1.0261 1.0144 1.0119 1.0022
dispcorr: -0.020487533 hartree
energy: -1777.722733730534
dipole: -33.73311 33.54458 -0.18853 9.41998 -10.27278 -0.85281 -7.60952 7.05639 -0.55314
magnitude: 1.03382 au
magnitude: 2.62776 debye
